Plant description on the 'Crop Planification and Production Process' ontology (C3PO)
type: Ontology
contributor: Baptiste Darnala
contributor: Florence Amardeilh
creator: Elzeard
description: Ontology code created by Chowlk
comment: Created by Elzeard, the Crop Planification and Production Process Ontology represents general informations about agroecological production. This module is about the general crop informations.
version info: 1.0

Calcium
type: ObjectProperty
domain: Nutrients dosage
range: Dosage
comment: One of the vegetal nutrients involved in the formation of cell walls by making them rigid, the activation of various enzymes and it promotes the growth of young roots
comment: Un élément nutritif des plantes participant à la constitution des parois cellulaires en les rigidifiant, à l'activation de différentes enzymes et il favorise la croissance des jeunes racines @fr

Magnesia
type: ObjectProperty
domain: Nutrients dosage
range: Dosage
comment: One of the vegetal nutrients involved in the formation of chlorophyll, the activation of many enzymes, the synthesis of proteins and sugars and their movement in the plant, the metabolism of phosphorus, the intracellular osmotic pressure as well as the cell wall rigidity
comment: Un élément nutritif des plantes participant à la formation de la chlorophylle, à l'activation de nombreuses enzymes, à la synthèse de protéines et sucres et à leur mouvement dans la plante, au métabolisme du phosphore, à la pression osmotique intracellulaire et à la rigidité des parois cellulaires @fr
label: Magnesium @fr

Nitrogen
type: ObjectProperty
domain: Nutrients dosage
range: Dosage
comment: One of the main vegetal nutrients, being one of the main constituants of amino acids, proteins and nucleic acids, it is therefore linked to the chlorophyll content
comment: Un des éléments nutritifs principaux des végétaux, étant l'un des principaux constituants des acides aminés, protéines et acides nucléiques, il est donc lié à la teneur en chlorophylle @fr
label: Azote @fr

Phosphorus
type: ObjectProperty
domain: Nutrients dosage
range: Dosage
comment: One of the main vegetal nutrients, related to the storage and transfer of energy inside the plant, as well as the formation of structural compounds
comment: Un des éléments nutritifs principaux des végétaux, lié au stockage et transfert d'énergie dans la plante et à la formation de composés structurels @fr
label: Phosphore @fr

Potassium
type: ObjectProperty
domain: Nutrients dosage
range: Dosage
comment: One of the main vegetal nutrients, involved in the formation et growth of cells and maintaining osmotic pressure
comment: Un des éléments nutritifs principaux des végétaux, participant à la formation et croissance des cellules ainsi qu'au maintien de la pression osmotique @fr

belongs to size category
type: ObjectProperty
domain: Cultivated plant
range: Class
  intersection of: Concept
  intersection of: Restriction
    on property: broader
    has value: PlantSizeCategory
label: appartient a la catégorie de taille @fr

depends on the season
type: ObjectProperty
domain: Cultivated plant
range: Class
  intersection of: Concept
  intersection of: Restriction
    on property: broader
    has value: Seasonality
label: dépend de la saison @fr

fits to market opportunity
type: ObjectProperty
domain: Variety
range: Class
  intersection of: Concept
  intersection of: Restriction
    on property: broader
    has value: ClientCategory
label: s’adapte à l’opportunité de marché @fr

germinates
type: ObjectProperty
domain: Cultivated plant
range: Germination step
label: germine à @fr

germinates at temperature
type: ObjectProperty
domain: Germination step
range: Temperature
label: germine à cette température @fr

grows
type: ObjectProperty
domain: Cultivated plant
range: Growing step
label: croît à cette étape @fr

grows at temperature
type: ObjectProperty
domain: Growing step
range: Temperature
label: croît à cette température @fr

harvests
type: ObjectProperty
domain: Cultivated plant
range: Harvest step
label: se récolte à @fr

has cleansing trait
type: ObjectProperty
domain: Cultivated plant
range: Class
  intersection of: Concept
  intersection of: Restriction
    on property: broader
    has value: CleansingLevel
label: a pour trait nettoyant @fr

has conservation capacity
type: ObjectProperty
domain: Cultivated plant
range: Class
  intersection of: Concept
  intersection of: Restriction
    on property: broader
    has value: ConservationLevel
label: a comme capacité de conservation @fr

has disease tolerance
type: ObjectProperty
domain: Cultivated plant
range: Class
  intersection of: Concept
  intersection of: Restriction
    on property: broader
    has value: ToleranceLevel
label: a pour tolérance aux maladies @fr

has duration from plant to harvest
type: ObjectProperty
domain: Growing step
range: Duration
label: a pour durée du plant à la récolte @fr

has duration from seeding to harvest
type: ObjectProperty
domain: Growing step
range: Duration
label: a pour durée du semis à la récolte @fr

has duration from seeding to plant
type: ObjectProperty
domain: Growing step
range: Duration
label: a pour durée du semis au plant @fr

has earliness duration
type: ObjectProperty
domain: Variety
range: Duration
label: a pour durée de précocité @fr

has an earliness stage of
type: ObjectProperty
domain: Variety
range: Class
  intersection of: Concept
  intersection of: Restriction
    on property: broader
    has value: EarlinessStage
label: a pour stade de précocité @fr

has effect
type: ObjectProperty
domain: Class
  union of: Association
  union of: Succession
range: Effect
label: a pour effet @fr

has frost tolerance
type: ObjectProperty
domain: Cultivated plant
range: Class
  intersection of: Concept
  intersection of: Restriction
    on property: broader
    has value: ToleranceLevel
label: a pour tolérance au gel @fr

has germination capacity
type: ObjectProperty
domain: Germination step
range: Duration
label: a pour capacité de germination @fr

has origin method
type: ObjectProperty
domain: Variety
range: Class
  intersection of: Concept
  intersection of: Restriction
    on property: broader
    has value: Origin
label: a pour méthode d'origine @fr

has for notation
type: ObjectProperty
domain: Effect
range: Class
  intersection of: Concept
  intersection of: Restriction
    on property: broader
    has value: Impact
label: a pour notation @fr

has plant length
type: ObjectProperty
domain: Variety
range: Length
label: a pour longueur de plante @fr

has for plot return time
type: ObjectProperty
domain: Cultivated plant
range: Duration
label: a pour temps de retour à la parcelle @fr

has for succession
type: ObjectProperty
domain: Class
  union of: Cultivated family
  union of: Plant
range: Succession
label: a pour succession @fr

has taxon name
type: ObjectProperty
domain: Class
  union of: Botanical family
  union of: Plant
range: TaxonName
label: has pour nom de taxon @fr

has watering need
type: ObjectProperty
domain: Cultivated plant
range: Class
  intersection of: Concept
  intersection of: Restriction
    on property: broader
    has value: WaterConsumptionLevel
label: a un besoin en irrigation @fr

has weight
type: ObjectProperty
domain: Variety
range: Weight
label: a pour poids @fr

is associated with
type: ObjectProperty
type: SymmetricProperty
domain: Association
range: Class
  union of: Cultivated family
  union of: Plant
label: est associé avec @fr

needs nutrition
type: ObjectProperty
domain: Cultivated plant
range: Class
  intersection of: Concept
  intersection of: Restriction
    on property: broader
    has value: NutritionalRequirement
label: a pour besoin nutritionnel @fr

stores
type: ObjectProperty
domain: Cultivated plant
range: Storage step
label: stocke @fr

stores at temperature
type: ObjectProperty
domain: Storage step
range: Temperature
label: se stocke à cette température @fr

takes root
type: ObjectProperty
domain: Cultivated plant
range: Class
  intersection of: Concept
  intersection of: Restriction
    on property: broader
    has value: RootDepth
label: prends racine @fr

effect description
type: DatatypeProperty
domain: Effect
range: string
label: description de l’effet @fr

gram of seeds per 1000 plants
type: DatatypeProperty
domain: Cultivated plant
range: decimal
label: nombre de grammes de graines pour 1000 plants @fr

is varietal type
type: DatatypeProperty
domain: Cultivated plant
range: boolean
label: est un type variétal @fr

max seeds per gramme
type: DatatypeProperty
domain: Cultivated plant
range: decimal
label: maximum de graine par gramme @fr

minimum seeds per gramme
type: DatatypeProperty
domain: Cultivated plant
range: decimal
label: minimum de graine par gramme @fr

plant color
type: DatatypeProperty
domain: Variety
range: string
label: couleur de plant @fr

plant description
type: DatatypeProperty
domain: Plant
range: string
label: description de la plante @fr

plant history
type: DatatypeProperty
domain: Plant
range: string
label: histoire de la plante @fr

plant shape
type: DatatypeProperty
domain: Variety
range: string
label: forme de la plante @fr

seeds per gram
type: DatatypeProperty
domain: Cultivated plant
range: decimal
label: graines par gramme @fr

shape description
type: DatatypeProperty
domain: Variety
range: string
label: description de la forme @fr

trait description
type: DatatypeProperty
domain: Variety
range: string
label: description du trait @fr

wikipedia link
type: DatatypeProperty
domain: Class
  union of: Cultivated family
  union of: Plant
range: string
label: lien wikipedia @fr

Association
type: Class
subclass of: Entity
comment: Procédé de production associant deux espèces ou variétés, ou plus, cultivées sur la même unité de surface au même moment @fr
comment: Production process consisting in associating two or more species or varieties on the same surface unit at the same time

Biological step
type: Class
subclass of: Entity
comment: Development stage of a plant
comment: Stade de développement d'une plante @fr
label: Étape biologique @fr

Botanical family
type: Class
subclass of: Cultivated family
comment: Rang taxonomique qui regroupe les genres qui présentent le plus de similitudes entre eux @fr
comment: Taxonomic rank regrouping genuses that have the most similarities between them
label: Famille botanique @fr

Variety
type: Class
subclass of: Restriction
  on property: has earliness duration
  max cardinality: 1
subclass of: Restriction
  on property: has an earliness stage of
  max cardinality: 1
subclass of: Restriction
  on property: has origin method
  max cardinality: 1
subclass of: Restriction
  on property: has plant length
  max cardinality: 1
subclass of: Restriction
  on property: has weight
  max cardinality: 1
subclass of: Restriction
  on property: plant color
  max cardinality: 1
subclass of: Restriction
  on property: plant shape
  max cardinality: 1
subclass of: Restriction
  on property: shape description
  max cardinality: 1
subclass of: Restriction
  on property: trait description
  max cardinality: 1
comment: Type végétal résultant d'une sélection, mutation ou hybridation et cultivé pour ses caractéristiques @fr
comment: Vegetal type resulting from selection, mutation or hybridation and cultivated for its characteristics
label: Cultivar @fr

Cultivated family
type: Class
subclass of: Entity
disjoint with: Plant
comment: Rang regroupant un ensemble de plantes cultivées @fr
comment: Rank grouping together a set of cultivated plants
label: Famille cultivée @fr

Cultivated plant
type: Class
subclass of: Plant
subclass of: Restriction
  on property: belongs to size category
  max cardinality: 1
subclass of: Restriction
  on property: exports
  max cardinality: 1
subclass of: Restriction
  on property: germinates
  max cardinality: 1
subclass of: Restriction
  on property: grows
  max cardinality: 1
subclass of: Restriction
  on property: harvests
  max cardinality: 1
subclass of: Restriction
  on property: has cleansing trait
  max cardinality: 1
subclass of: Restriction
  on property: has conservation capacity
  max cardinality: 1
subclass of: Restriction
  on property: has disease tolerance
  max cardinality: 1
subclass of: Restriction
  on property: has frost tolerance
  max cardinality: 1
subclass of: Restriction
  on property: has for plot return time
  max cardinality: 1
subclass of: Restriction
  on property: has watering need
  max cardinality: 1
subclass of: Restriction
  on property: needs
  max cardinality: 1
subclass of: Restriction
  on property: needs nutrition
  max cardinality: 1
subclass of: Restriction
  on property: stores
  max cardinality: 1
subclass of: Restriction
  on property: takes root
  max cardinality: 1
subclass of: Restriction
  on property: is varietal type
  cardinality: 1
subclass of: Restriction
  on property: gram of seeds per 1000 plants
  max cardinality: 1
subclass of: Restriction
  on property: max seeds per gramme
  max cardinality: 1
subclass of: Restriction
  on property: minimum seeds per gramme
  max cardinality: 1
subclass of: Restriction
  on property: seeds per gram
  max cardinality: 1
comment: Organisme végétal cultivé par les êtres humains @fr
comment: Vegetal organism cultivated by human beings
label: Plante cultivée @fr

Effect
type: Class
subclass of: Entity
subclass of: Restriction
  on property: effect description
  max cardinality: 1
comment: Impact d'une plante cultivée sur une autre dû à la proximité spatiale (association) ou temporelle (succession) des deux plantes @fr
comment: Impact of one crop on another due to the spatial (association) or temporal (succession) proximity of the two plants
label: Effet @fr

Germination step
type: Class
subclass of: Biological step
subclass of: Restriction
  on property: germinates at temperature
  max cardinality: 1
subclass of: Restriction
  on property: has germination capacity
  max cardinality: 1
comment: Phase du processus de croissance d’une plante durant laquelle le développement de la graine aboutit à un plant @fr
comment: Stage of the growth process of a plant during which the seed develops into a plant
label: Étape de germination @fr

Growing step
type: Class
subclass of: Biological step
subclass of: Restriction
  on property: grows at temperature
  max cardinality: 1
subclass of: Restriction
  on property: has duration from plant to harvest
  max cardinality: 1
subclass of: Restriction
  on property: has duration from seeding to harvest
  max cardinality: 1
subclass of: Restriction
  on property: has duration from seeding to plant
  max cardinality: 1
comment: Phase du processus de croissance d’une plante durant laquelle le développement du plant aboutit à l'obtention d'un produit récoltable @fr
comment: Stage of the growth process of a plant during which the plant's development leads to a harvestable product
label: Étape de croissance @fr

Harvest step
type: Class
subclass of: Biological step
comment: Phase du processus de production durant laquelle un produit agricole est récolté @fr
comment: Stage of the production process during which an agricultural product is harvested
label: Étape de récolte @fr

Nutrients dosage
type: Class
subclass of: Entity
subclass of: Restriction
  on property: Calcium
  max cardinality: 1
subclass of: Restriction
  on property: Magnesia
  max cardinality: 1
subclass of: Restriction
  on property: Nitrogen
  max cardinality: 1
subclass of: Restriction
  on property: Phosphorus
  max cardinality: 1
subclass of: Restriction
  on property: Potassium
  max cardinality: 1
comment: A measure of the amount of nutrients (mainly nitrogen, phosphorus and potassium) required by the crop or exported from the plot soil after harvest
comment: Mesure de la quantité d'éléments nutritifs (principalement azote, phosphore et potassium) dont a besoin la plante cultivée ou qui est exportée du sol de la parcelle après récolte de celle-ci @fr
label: Dosage des éléments nutritifs @fr

Plant
type: Class
subclass of: Entity
comment: Organisme végétal à racines, tige, feuilles (excluant les champignons, mousse et lichen) @fr
comment: Vegetal organism with roots, stem and leafs (exception made from fungi, moss and lichen)
label: Plante @fr

Time return plot
type: Class
subclass of: Entity
comment: Indicative time period during which it's discouraged to cultivate the same species on the same surface unit
comment: Laps de temps indicatif durant lequel il est déconseillé de cultiver une même espèce sur une même unité de surface @fr
label: Temps de retour à la parcelle @fr

Storage step
type: Class
subclass of: Biological step
subclass of: Restriction
  on property: stores at temperature
  max cardinality: 1
comment: Phase du processus de production durant laquelle un produit récolté est stocké en vue d'une commercialisation @fr
comment: Stage of the production process during which a harvested product is stored in order to sell it
label: Étape de stockage @fr

Succession
type: Class
subclass of: Entity
comment: Succession temporelle de plusieurs espèces ou variétés cultivées sur la même unité de surface @fr
comment: Temporal succession of several species or varieties cultivated on the same surface unit

Usage family
type: Class
subclass of: Cultivated family
comment: Arbitrary ranking of cultivated plants by their use (agricultural role) in France
comment: Rang arbitraire regroupant les plantes cultivées par usage (rôle agricole) en France @fr
label: Famille d’usage @fr

belongs to plant category
label: appartient à la catégorie de plante @fr

effect
label: effet @fr

has association
label: a pour association @fr

positive
label: positif @fr

scientific name
label: nom scientifique @fr