Plant description on the 'Crop Planification and Production Process' ontology (C3PO)
type: Ontology
contributor: Baptiste Darnala
contributor: Florence Amardeilh
creator: Elzeard
description: Ontology code created by Chowlk
comment: Created by Elzeard, the Crop Planification and Production Process Ontology represents general informations about agroecological production. This module is about the general crop informations.
version info: 1.0

Association
type: Class
comment: Procédé de production associant deux espèces ou variétés, ou plus, cultivées sur la même unité de surface au même moment @fr
comment: Production process consisting in associating two or more species or varieties on the same surface unit at the same time
subclass of: Entity

Biological step
type: Class
comment: Development stage of a plant
comment: Stade de développement d'une plante @fr
label: Étape biologique @fr
subclass of: Entity

Botanical family
type: Class
comment: Rang taxonomique qui regroupe les genres qui présentent le plus de similitudes entre eux @fr
comment: Taxonomic rank regrouping genuses that have the most similarities between them
label: Famille botanique @fr
subclass of: Cultivated family

Calcium
type: ObjectProperty
comment: One of the vegetal nutrients involved in the formation of cell walls by making them rigid, the activation of various enzymes and it promotes the growth of young roots
comment: Un élément nutritif des plantes participant à la constitution des parois cellulaires en les rigidifiant, à l'activation de différentes enzymes et il favorise la croissance des jeunes racines @fr
domain: Nutrients dosage
range: Dosage

Variety
type: Class
comment: Type végétal résultant d'une sélection, mutation ou hybridation et cultivé pour ses caractéristiques @fr
comment: Vegetal type resulting from selection, mutation or hybridation and cultivated for its characteristics
label: Cultivar @fr
subclass of: Restriction
  max cardinality: 1
  on property: has earliness duration
subclass of: Restriction
  max cardinality: 1
  on property: has an earliness stage of
subclass of: Restriction
  max cardinality: 1
  on property: has origin method
subclass of: Restriction
  max cardinality: 1
  on property: has plant length
subclass of: Restriction
  max cardinality: 1
  on property: has weight
subclass of: Restriction
  max cardinality: 1
  on property: plant color
subclass of: Restriction
  max cardinality: 1
  on property: plant shape
subclass of: Restriction
  max cardinality: 1
  on property: shape description
subclass of: Restriction
  max cardinality: 1
  on property: trait description

Cultivated family
type: Class
comment: Rang regroupant un ensemble de plantes cultivées @fr
comment: Rank grouping together a set of cultivated plants
label: Famille cultivée @fr
subclass of: Entity
disjoint with: Plant

Cultivated plant
type: Class
comment: Organisme végétal cultivé par les êtres humains @fr
comment: Vegetal organism cultivated by human beings
label: Plante cultivée @fr
subclass of: Plant
subclass of: Restriction
  max cardinality: 1
  on property: belongs to size category
subclass of: Restriction
  max cardinality: 1
  on property: exports
subclass of: Restriction
  max cardinality: 1
  on property: germinates
subclass of: Restriction
  max cardinality: 1
  on property: grows
subclass of: Restriction
  max cardinality: 1
  on property: harvests
subclass of: Restriction
  max cardinality: 1
  on property: has cleansing trait
subclass of: Restriction
  max cardinality: 1
  on property: has conservation capacity
subclass of: Restriction
  max cardinality: 1
  on property: has disease tolerance
subclass of: Restriction
  max cardinality: 1
  on property: has frost tolerance
subclass of: Restriction
  max cardinality: 1
  on property: has for plot return time
subclass of: Restriction
  max cardinality: 1
  on property: has watering need
subclass of: Restriction
  max cardinality: 1
  on property: needs
subclass of: Restriction
  max cardinality: 1
  on property: needs nutrition
subclass of: Restriction
  max cardinality: 1
  on property: stores
subclass of: Restriction
  max cardinality: 1
  on property: takes root
subclass of: Restriction
  cardinality: 1
  on property: is varietal type
subclass of: Restriction
  max cardinality: 1
  on property: gram of seeds per 1000 plants
subclass of: Restriction
  max cardinality: 1
  on property: max seeds per gramme
subclass of: Restriction
  max cardinality: 1
  on property: minimum seeds per gramme
subclass of: Restriction
  max cardinality: 1
  on property: seeds per gram

Effect
type: Class
comment: Impact d'une plante cultivée sur une autre dû à la proximité spatiale (association) ou temporelle (succession) des deux plantes @fr
comment: Impact of one crop on another due to the spatial (association) or temporal (succession) proximity of the two plants
label: Effet @fr
subclass of: Entity
subclass of: Restriction
  max cardinality: 1
  on property: effect description

Germination step
type: Class
comment: Phase du processus de croissance d’une plante durant laquelle le développement de la graine aboutit à un plant @fr
comment: Stage of the growth process of a plant during which the seed develops into a plant
label: Étape de germination @fr
subclass of: Biological step
subclass of: Restriction
  max cardinality: 1
  on property: germinates at temperature
subclass of: Restriction
  max cardinality: 1
  on property: has germination capacity

Growing step
type: Class
comment: Phase du processus de croissance d’une plante durant laquelle le développement du plant aboutit à l'obtention d'un produit récoltable @fr
comment: Stage of the growth process of a plant during which the plant's development leads to a harvestable product
label: Étape de croissance @fr
subclass of: Biological step
subclass of: Restriction
  max cardinality: 1
  on property: grows at temperature
subclass of: Restriction
  max cardinality: 1
  on property: has duration from plant to harvest
subclass of: Restriction
  max cardinality: 1
  on property: has duration from seeding to harvest
subclass of: Restriction
  max cardinality: 1
  on property: has duration from seeding to plant

Harvest step
type: Class
comment: Phase du processus de production durant laquelle un produit agricole est récolté @fr
comment: Stage of the production process during which an agricultural product is harvested
label: Étape de récolte @fr
subclass of: Biological step

Magnesia
type: ObjectProperty
comment: One of the vegetal nutrients involved in the formation of chlorophyll, the activation of many enzymes, the synthesis of proteins and sugars and their movement in the plant, the metabolism of phosphorus, the intracellular osmotic pressure as well as the cell wall rigidity
comment: Un élément nutritif des plantes participant à la formation de la chlorophylle, à l'activation de nombreuses enzymes, à la synthèse de protéines et sucres et à leur mouvement dans la plante, au métabolisme du phosphore, à la pression osmotique intracellulaire et à la rigidité des parois cellulaires @fr
domain: Nutrients dosage
label: Magnesium @fr
range: Dosage

Nitrogen
type: ObjectProperty
comment: One of the main vegetal nutrients, being one of the main constituants of amino acids, proteins and nucleic acids, it is therefore linked to the chlorophyll content
comment: Un des éléments nutritifs principaux des végétaux, étant l'un des principaux constituants des acides aminés, protéines et acides nucléiques, il est donc lié à la teneur en chlorophylle @fr
domain: Nutrients dosage
label: Azote @fr
range: Dosage

Nutrients dosage
type: Class
comment: A measure of the amount of nutrients (mainly nitrogen, phosphorus and potassium) required by the crop or exported from the plot soil after harvest
comment: Mesure de la quantité d'éléments nutritifs (principalement azote, phosphore et potassium) dont a besoin la plante cultivée ou qui est exportée du sol de la parcelle après récolte de celle-ci @fr
label: Dosage des éléments nutritifs @fr
subclass of: Entity
subclass of: Restriction
  max cardinality: 1
  on property: Calcium
subclass of: Restriction
  max cardinality: 1
  on property: Magnesia
subclass of: Restriction
  max cardinality: 1
  on property: Nitrogen
subclass of: Restriction
  max cardinality: 1
  on property: Phosphorus
subclass of: Restriction
  max cardinality: 1
  on property: Potassium

Phosphorus
type: ObjectProperty
comment: One of the main vegetal nutrients, related to the storage and transfer of energy inside the plant, as well as the formation of structural compounds
comment: Un des éléments nutritifs principaux des végétaux, lié au stockage et transfert d'énergie dans la plante et à la formation de composés structurels @fr
domain: Nutrients dosage
label: Phosphore @fr
range: Dosage

Plant
type: Class
comment: Organisme végétal à racines, tige, feuilles (excluant les champignons, mousse et lichen) @fr
comment: Vegetal organism with roots, stem and leafs (exception made from fungi, moss and lichen)
label: Plante @fr
subclass of: Entity

Time return plot
type: Class
comment: Indicative time period during which it's discouraged to cultivate the same species on the same surface unit
comment: Laps de temps indicatif durant lequel il est déconseillé de cultiver une même espèce sur une même unité de surface @fr
label: Temps de retour à la parcelle @fr
subclass of: Entity

Potassium
type: ObjectProperty
comment: One of the main vegetal nutrients, involved in the formation et growth of cells and maintaining osmotic pressure
comment: Un des éléments nutritifs principaux des végétaux, participant à la formation et croissance des cellules ainsi qu'au maintien de la pression osmotique @fr
domain: Nutrients dosage
range: Dosage

Storage step
type: Class
comment: Phase du processus de production durant laquelle un produit récolté est stocké en vue d'une commercialisation @fr
comment: Stage of the production process during which a harvested product is stored in order to sell it
label: Étape de stockage @fr
subclass of: Biological step
subclass of: Restriction
  max cardinality: 1
  on property: stores at temperature

Succession
type: Class
comment: Succession temporelle de plusieurs espèces ou variétés cultivées sur la même unité de surface @fr
comment: Temporal succession of several species or varieties cultivated on the same surface unit
subclass of: Entity

Usage family
type: Class
comment: Arbitrary ranking of cultivated plants by their use (agricultural role) in France
comment: Rang arbitraire regroupant les plantes cultivées par usage (rôle agricole) en France @fr
label: Famille d’usage @fr
subclass of: Cultivated family

belongs to size category
type: ObjectProperty
domain: Cultivated plant
label: appartient a la catégorie de taille @fr
range: Class
  intersection of: Concept
  intersection of: Restriction
    has value: PlantSizeCategory
    on property: broader

belongs to plant category
label: appartient à la catégorie de plante @fr

depends on the season
type: ObjectProperty
domain: Cultivated plant
label: dépend de la saison @fr
range: Class
  intersection of: Concept
  intersection of: Restriction
    has value: Seasonality
    on property: broader

effect
label: effet @fr

effect description
type: DatatypeProperty
domain: Effect
label: description de l’effet @fr
range: string

fits to market opportunity
type: ObjectProperty
domain: Variety
label: s’adapte à l’opportunité de marché @fr
range: Class
  intersection of: Concept
  intersection of: Restriction
    has value: ClientCategory
    on property: broader

germinates
type: ObjectProperty
domain: Cultivated plant
label: germine à @fr
range: Germination step

germinates at temperature
type: ObjectProperty
domain: Germination step
label: germine à cette température @fr
range: Temperature

gram of seeds per 1000 plants
type: DatatypeProperty
domain: Cultivated plant
label: nombre de grammes de graines pour 1000 plants @fr
range: decimal

grows
type: ObjectProperty
domain: Cultivated plant
label: croît à cette étape @fr
range: Growing step

grows at temperature
type: ObjectProperty
domain: Growing step
label: croît à cette température @fr
range: Temperature

harvests
type: ObjectProperty
domain: Cultivated plant
label: se récolte à @fr
range: Harvest step

has association
label: a pour association @fr

has cleansing trait
type: ObjectProperty
domain: Cultivated plant
label: a pour trait nettoyant @fr
range: Class
  intersection of: Concept
  intersection of: Restriction
    has value: CleansingLevel
    on property: broader

has conservation capacity
type: ObjectProperty
domain: Cultivated plant
label: a comme capacité de conservation @fr
range: Class
  intersection of: Concept
  intersection of: Restriction
    has value: ConservationLevel
    on property: broader

has disease tolerance
type: ObjectProperty
domain: Cultivated plant
label: a pour tolérance aux maladies @fr
range: Class
  intersection of: Concept
  intersection of: Restriction
    has value: ToleranceLevel
    on property: broader

has duration from plant to harvest
type: ObjectProperty
domain: Growing step
label: a pour durée du plant à la récolte @fr
range: Duration

has duration from seeding to harvest
type: ObjectProperty
domain: Growing step
label: a pour durée du semis à la récolte @fr
range: Duration

has duration from seeding to plant
type: ObjectProperty
domain: Growing step
label: a pour durée du semis au plant @fr
range: Duration

has earliness duration
type: ObjectProperty
domain: Variety
label: a pour durée de précocité @fr
range: Duration

has an earliness stage of
type: ObjectProperty
domain: Variety
label: a pour stade de précocité @fr
range: Class
  intersection of: Concept
  intersection of: Restriction
    has value: EarlinessStage
    on property: broader

has effect
type: ObjectProperty
domain: Class
  union of: Association
  union of: Succession
label: a pour effet @fr
range: Effect

has frost tolerance
type: ObjectProperty
domain: Cultivated plant
label: a pour tolérance au gel @fr
range: Class
  intersection of: Concept
  intersection of: Restriction
    has value: ToleranceLevel
    on property: broader

has germination capacity
type: ObjectProperty
domain: Germination step
label: a pour capacité de germination @fr
range: Duration

has origin method
type: ObjectProperty
domain: Variety
label: a pour méthode d'origine @fr
range: Class
  intersection of: Concept
  intersection of: Restriction
    has value: Origin
    on property: broader

has for notation
type: ObjectProperty
domain: Effect
label: a pour notation @fr
range: Class
  intersection of: Concept
  intersection of: Restriction
    has value: Impact
    on property: broader

has plant length
type: ObjectProperty
domain: Variety
label: a pour longueur de plante @fr
range: Length

has for plot return time
type: ObjectProperty
domain: Cultivated plant
label: a pour temps de retour à la parcelle @fr
range: Duration

has for succession
type: ObjectProperty
domain: Class
  union of: Cultivated family
  union of: Plant
label: a pour succession @fr
range: Succession

has taxon name
type: ObjectProperty
domain: Class
  union of: Botanical family
  union of: Plant
label: has pour nom de taxon @fr
range: TaxonName

has watering need
type: ObjectProperty
domain: Cultivated plant
label: a un besoin en irrigation @fr
range: Class
  intersection of: Concept
  intersection of: Restriction
    has value: WaterConsumptionLevel
    on property: broader

has weight
type: ObjectProperty
domain: Variety
label: a pour poids @fr
range: Weight

is associated with
type: ObjectProperty
type: SymmetricProperty
domain: Association
label: est associé avec @fr
range: Class
  union of: Cultivated family
  union of: Plant

is varietal type
type: DatatypeProperty
domain: Cultivated plant
label: est un type variétal @fr
range: boolean

max seeds per gramme
type: DatatypeProperty
domain: Cultivated plant
label: maximum de graine par gramme @fr
range: decimal

minimum seeds per gramme
type: DatatypeProperty
domain: Cultivated plant
label: minimum de graine par gramme @fr
range: decimal

needs nutrition
type: ObjectProperty
domain: Cultivated plant
label: a pour besoin nutritionnel @fr
range: Class
  intersection of: Concept
  intersection of: Restriction
    has value: NutritionalRequirement
    on property: broader

plant color
type: DatatypeProperty
domain: Variety
label: couleur de plant @fr
range: string

plant description
type: DatatypeProperty
domain: Plant
label: description de la plante @fr
range: string

plant history
type: DatatypeProperty
domain: Plant
label: histoire de la plante @fr
range: string

plant shape
type: DatatypeProperty
domain: Variety
label: forme de la plante @fr
range: string

positive
label: positif @fr

scientific name
label: nom scientifique @fr

seeds per gram
type: DatatypeProperty
domain: Cultivated plant
label: graines par gramme @fr
range: decimal

shape description
type: DatatypeProperty
domain: Variety
label: description de la forme @fr
range: string

stores
type: ObjectProperty
domain: Cultivated plant
label: stocke @fr
range: Storage step

stores at temperature
type: ObjectProperty
domain: Storage step
label: se stocke à cette température @fr
range: Temperature

takes root
type: ObjectProperty
domain: Cultivated plant
label: prends racine @fr
range: Class
  intersection of: Concept
  intersection of: Restriction
    has value: RootDepth
    on property: broader

trait description
type: DatatypeProperty
domain: Variety
label: description du trait @fr
range: string

wikipedia link
type: DatatypeProperty
domain: Class
  union of: Cultivated family
  union of: Plant
label: lien wikipedia @fr
range: string