Crop itinerary description of the 'crop planification and production process' ontology
type: Ontology
contributor: Baptiste Darnala
contributor: Florence Amardeilh
creator: Elzeard
description: Ontology code created by Chowlk
comment: Created by Elzeard, crop planification and production process ontology represents general informations about agroecological vegetable production. This module is about the crop itinerary description.
version info: 1.0

acts on stage
type: ObjectProperty
domain: Technical operation
range: BiologicalStep
label: agit sur le stade @fr

applies this crop itinerary
type: ObjectProperty
domain: Production process
range: Crop itinerary
label: applique cet itinéraire de culture @fr

belongs to administrative region
type: ObjectProperty
domain: Soil and climate context
range: Class
  intersection of: Concept
  intersection of: Restriction
    has value: Region
    on property: broader
label: appartient à une région administrative @fr

concerns plant
type: ObjectProperty
domain: Crop itinerary
range: CultivatedPlant
label: concerne la plante @fr

concerns position
type: ObjectProperty
domain: Activity
domain: Operation task
range: LandUse
label: concerne l'emplacement @fr

cultivates in
type: ObjectProperty
domain: Cultural context
range: Class
  intersection of: Concept
  intersection of: Restriction
    has value: FarmingSystem
    on property: broader
label: cultive en @fr

depends on cultural context
type: ObjectProperty
domain: Crop itinerary
range: Cultural context
label: dépend d'un contexte de culture @fr

depends on soil climate context
type: ObjectProperty
domain: Crop itinerary
range: Soil and climate context
label: dépend d'un contexte pédo-climatique @fr

distance duration
type: ObjectProperty
domain: Distance between operations
range: Duration
label: durée de distance @fr

edge distance
type: ObjectProperty
domain: Row layout
range: Length
label: distance au bord @fr

follows
type: ObjectProperty
inverse of: precedes
domain: Crop entity
range: Crop entity
label: suit @fr

generates activity
type: ObjectProperty
domain: Operation task
range: Activity
label: génère l'intervention @fr

generates operational task
type: ObjectProperty
domain: Technical operation
range: Operation task
label: génère la tâche opérationnelle @fr

grows according to
type: ObjectProperty
domain: Plant
range: Biological process
label: croît selon @fr

has assertion
type: ObjectProperty
domain: Condition
range: Context
label: a pour argument @fr

is assigned to
type: ObjectProperty
domain: Activity
range: Producer
label: est assigné(e) à @fr

has bed planting densité
type: ObjectProperty
domain: Crop establishment
range: PlantingDensity
label: a pour densité d’implantation sur planche @fr

has climate
type: ObjectProperty
domain: Climate context
range: Class
  intersection of: Concept
  intersection of: Restriction
    has value: Climate
    on property: broader
label: a pour climat @fr

has climate characteristic
type: ObjectProperty
domain: Climate context
range: Class
  intersection of: Concept
  intersection of: Restriction
    has value: ClimateCharacteristics
    on property: broader
label: a pour caractéristique climatique @fr

has climate context
type: ObjectProperty
domain: Soil and climate context
range: Climate context
label: a pour contexte climatique @fr

has conclusion
type: ObjectProperty
domain: Condition
range: Thing
label: a pour conclusion @fr

has conservation duration
type: ObjectProperty
domain: Crop itinerary
range: Duration
label: a pour durée de conservation @fr

has cultivable position
type: ObjectProperty
domain: Class
  union of: Activity
  union of: Series
range: Cultivable position
label: a pour emplacement cultivable @fr

has cultural context
type: ObjectProperty
domain: Farm
range: Cultural context
label: a un contexte de culture @fr

has cultural role
type: ObjectProperty
domain: Plant material
range: Class
  intersection of: Concept
  intersection of: Restriction
    has value: CultureRole
    on property: broader
label: a pour rôle cultural @fr

has culture mode
type: ObjectProperty
domain: Crop itinerary
range: Class
  intersection of: Concept
  intersection of: Restriction
    has value: CultureMode
    on property: broader
label: a pour mode de culture @fr

has duration
type: ObjectProperty
domain: Activity
range: Duration
label: a pour durée @fr

has farm equipment level
type: ObjectProperty
domain: Cultural context
range: Class
  intersection of: Concept
  intersection of: Restriction
    has value: FarmEquipmentLevel
    on property: broader
label: a pour niveau d’équipement @fr

has farming practice parameter
type: ObjectProperty
sub property of: hasParameter
range: CultivationParameter
label: a pour paramètre de pratique agricole @fr

has following rotation
type: ObjectProperty
inverse of: has preceding rotation
domain: Cultivable position
range: Cultivable position
label: a pour rotation suivante @fr

has global available volume
type: ObjectProperty
domain: Crop
range: HarvestQuantity
label: a pour volume global disponible @fr

has global booked volume
type: ObjectProperty
domain: Crop
range: HarvestQuantity
label: a pour volume global pré-réservé @fr

has global delivered volume
type: ObjectProperty
domain: Crop
range: HarvestQuantity
label: a pour volume global livré @fr

has global estimated volume
type: ObjectProperty
domain: Crop
range: HarvestQuantity
label: a pour volume global estimé @fr

has global ordered volume
type: ObjectProperty
domain: Crop
range: HarvestQuantity
label: a pour volume global commandé @fr

has global workload
type: ObjectProperty
sub property of: hasParameter
domain: Crop itinerary
range: Workload
label: a pour charge de travail globale @fr

has harvest duration
type: ObjectProperty
domain: Crop itinerary
range: Duration
label: a pour durée de récolte @fr

has harvest mode
type: ObjectProperty
domain: Harvest
range: Class
  intersection of: Concept
  intersection of: Restriction
    has value: HarvestMode
    on property: broader
label: a pour mode de récolte @fr

has harvest quantity
type: ObjectProperty
sub property of: has farming practice parameter
domain: Harvest
range: HarvestQuantity
label: a pour quantité de récolte @fr

has input dose
type: ObjectProperty
sub property of: has farming practice parameter
domain: Class
  union of: Biological plant protection
  union of: Fertilisation
  union of: Phytosanitary protection
  union of: Soil amendment
range: Dosage
label: a pour dose d'intrant @fr

has irrigation duration
type: ObjectProperty
domain: Watering
range: Duration
label: a pour durée d'irrigation @fr

has irrigation mode
type: ObjectProperty
domain: Class
  union of: Crop itinerary
  union of: Irrigation
range: Class
  intersection of: Concept
  intersection of: Restriction
    has value: IrrigationMode
    on property: broader
label: a pour mode d’irrigation @fr

has irrigation quantity
type: ObjectProperty
sub property of: hasParameter
domain: Watering
range: Volume
label: a pour quantité d'irrigation @fr

has length position
type: ObjectProperty
sub property of: hasParameter
domain: Cultivable position
range: Length
label: a pour longueur d'emplacement @fr

has maturation duration
type: ObjectProperty
domain: Crop itinerary
range: Duration
label: a pour durée de maturité @fr

has member
type: ObjectProperty
inverse of: is member of
domain: Collection
range: Crop entity
label: a pour membre @fr

has nursery duration
type: ObjectProperty
domain: Crop itinerary
range: Duration
label: a pour durée de pépinière @fr

has observation
type: ObjectProperty
domain: Thing
range: Observation
label: a pour observation @fr

has observed subject
type: ObjectProperty
domain: Observation
range: Class
  intersection of: Concept
  intersection of: Restriction
    has value: ObservedSubject
    on property: broader
label: a pour type d'observation @fr

has operation distance
type: ObjectProperty
domain: Operation
range: Distance between operations
label: a pour distance d’opération @fr

had operation member
type: ObjectProperty
sub property of: has member
label: est composé de l'opération @fr

has period
type: ObjectProperty
domain: Class
  union of: Operation task
  union of: Series
range: ProperInterval
label: a pour période @fr

has favored photoperiodicity
type: ObjectProperty
domain: Technical operation
range: Class
  intersection of: Concept
  intersection of: Restriction
    has value: PhotoPeriodicity
    on property: broader
label: a pour photopériode privilégiée @fr

has planting density
type: ObjectProperty
sub property of: has farming practice parameter
label: a pour densité d'implantation @fr

has plot planting density
type: ObjectProperty
domain: Crop establishment
range: PlantingDensity
label: a pour densité d’implantation sur parcelle @fr

has position surface
type: ObjectProperty
sub property of: hasSurface
domain: Cultivable position
range: Surface
label: a pour surface emplacement @fr

has preceding rotation
type: ObjectProperty
domain: Cultivable position
range: Cultivable position
label: a pour rotation précédente @fr

has relative period
type: ObjectProperty
domain: Class
  union of: Crop itinerary
  union of: Technical operation
range: RelativeProperInterval
label: a pour période relative @fr

has seasonality
type: ObjectProperty
domain: Crop itinerary
range: Class
  intersection of: Concept
  intersection of: Restriction
    has value: Seasonality
    on property: broader
label: a pour saisonnalité @fr

has seeding density
type: ObjectProperty
domain: Crop establishment
range: PlantingDensity
label: a pour densité de semence @fr

has series member
type: ObjectProperty
sub property of: has member
domain: Production process
range: Series
label: est composé de la série @fr

has soil climate context
type: ObjectProperty
domain: Farm
range: Soil and climate context
label: a pour contexte pédo-climatique @fr

has soil context
type: ObjectProperty
domain: Soil and climate context
range: Soil context
label: a pour contexte de sol @fr

has soil nature
type: ObjectProperty
domain: Soil context
range: Class
  intersection of: Concept
  intersection of: Restriction
    has value: SoilNature
    on property: broader
label: a pour nature du sol @fr

has soil texture
type: ObjectProperty
domain: Soil context
range: Class
  intersection of: Concept
  intersection of: Restriction
    has value: SoilTexture
    on property: broader
label: a pour texture de sol @fr

has member stage
type: ObjectProperty
sub property of: has member
domain: Biological process
range: BiologicalStep
label: a pour stade membre @fr

has storage duration
type: ObjectProperty
domain: Storage
range: Duration
label: a pour durée de stockage @fr

has stored quantitiy
type: ObjectProperty
domain: Storage
range: HarvestQuantity
label: a pour quantité stocké @fr

has supplier
type: ObjectProperty
domain: Resource
range: Supplier
label: a pour fournisseur @fr

had task member
type: ObjectProperty
sub property of: has member
domain: Series
range: Operation task
label: est composé de la tâche @fr

has workload
type: ObjectProperty
sub property of: hasParameter
domain: Practice
range: Workload
label: a pour charge de travail @fr

has yield
type: ObjectProperty
sub property of: hasParameter
domain: Class
  union of: Procedure
  union of: Process
range: Yield
label: a pour rendement @fr

implements
type: ObjectProperty
domain: Operation
range: Farming practice
label: met en oeuvre @fr

influences
type: ObjectProperty
domain: Operation
range: Cultural context
label: influence @fr

is associated with
type: ObjectProperty
domain: Production process
range: Production process
label: est associé avec @fr

is constrained by
type: ObjectProperty
domain: Class
  union of: Crop itinerary
  union of: Technical operation
range: Condition
label: est contraint par @fr

is cultivated according to
type: ObjectProperty
domain: CultivatedPlant
range: Production process
label: est cultivée selon @fr

is derived from
type: ObjectProperty
label: a pour référence @fr

is derived from itinerary
type: ObjectProperty
sub property of: is derived from
domain: Crop itinerary
range: Crop itinerary
label: a pour itinéraire de culture de référence @fr

has reference operation
type: ObjectProperty
sub property of: is derived from
domain: Technical operation
range: Technical operation
label: a pour opération de référence @fr

is derived from stage
type: ObjectProperty
sub property of: is derived from
domain: BiologicalStep
range: BiologicalStep
label: est dérivée du stade @fr

is located
type: ObjectProperty
domain: Cultivable position
range: CultivableLand
label: est situé @fr

is member of
type: ObjectProperty
label: est membre de @fr

is specialised from itinerary
type: ObjectProperty
domain: Crop itinerary
range: Crop itinerary
label: est spécialisé depuis l’itinéraire @fr

occurs at
type: ObjectProperty
domain: Activity
range: Instant
label: se produit à @fr

precedes
type: ObjectProperty
domain: Crop entity
range: Crop entity
label: précède @fr

produces
type: ObjectProperty
domain: Production process
range: Crop
label: produit @fr

recommends association
type: ObjectProperty
domain: Crop itinerary
range: Association
label: association de culture recommandée @fr

recommends cultivar
type: ObjectProperty
domain: Crop itinerary
range: Cultivar
label: cultivar recommandé @fr

recommends rotation
type: ObjectProperty
domain: Crop itinerary
range: Rotation
label: rotation de culture recommandée @fr

refers to operation
type: ObjectProperty
domain: Distance between operations
range: Operation
label: se réfère à l’opération @fr

selects cultivar
type: ObjectProperty
domain: Farm
range: Cultivar
label: selectionne pour cultivar @fr

spacing between rows
type: ObjectProperty
domain: Row layout
range: Length
label: espacement entre les rangs @fr

spacing in row
type: ObjectProperty
domain: Row layout
range: Length
label: espacement dans le rang @fr

uses cultivar
type: ObjectProperty
domain: Plant material
range: Cultivar
label: utilise pour cultivar @fr

uses farming equipment
type: ObjectProperty
domain: Farming practice
range: Equipment
label: utilise matériel agricole @fr

uses input
type: ObjectProperty
domain: Class
  union of: Biological plant protection
  union of: Fertilisation
  union of: Phytosanitary protection
  union of: Soil amendment
range: Intrant
label: utilise intrant @fr

uses plant material
type: ObjectProperty
domain: Plant material
range: Series
label: utilise matériel végétal @fr

comment
type: DatatypeProperty
domain: Observation
range: Literal
label: commentaire @fr

description
type: DatatypeProperty
domain: Farming practice
range: string

end marker
type: DatatypeProperty
domain: Distance between operations
range: boolean
label: marqueur de fin @fr

frequency
type: DatatypeProperty
domain: Technical operation
range: Literal
label: fréquence @fr

harvest margin loss
type: DatatypeProperty
domain: Harvest
range: decimal
label: marge de perte pour la récolte @fr

is forced crop
type: DatatypeProperty
domain: Crop itinerary
range: boolean
label: est une culture forcée @fr

is a grafted crop
type: DatatypeProperty
domain: Crop itinerary
range: boolean
label: est une culture greffée @fr

loss margin
type: DatatypeProperty
domain: Crop itinerary
range: decimal
label: Marge de perte @fr

negation
type: DatatypeProperty
domain: Condition
range: boolean
label: négation @fr

plants number
type: DatatypeProperty
domain: Planting
range: decimal
label: nombre de plants @fr

number rows
type: DatatypeProperty
domain: Row layout
range: integer
label: nombre de rangs @fr

seeds number
type: DatatypeProperty
domain: Seed drilling
range: decimal
label: nombre de graines @fr

observation date
type: DatatypeProperty
domain: Observation
range: dateTimeStamp
label: date d’observation @fr

soil Ph
type: DatatypeProperty
domain: Soil context
range: decimal
label: Ph du sol @fr

surface done
type: DatatypeProperty
domain: Activity
range: decimal
label: surface réalisée @fr

thinning rate
type: DatatypeProperty
domain: Class
  union of: Broadcast planting process
  union of: Seed drilling
range: decimal
label: taux d’éclaircissage @fr

Activity
type: Class
subclass of: Operation
comment: Carrying out a technical operation by one person on a plot at a given time.
comment: Réalisation d'une opération technique par une personne sur une parcelle à un moment donné. @fr
label: Intervention @fr

Biological plant protection
type: Class
subclass of: Plant protection
comment: Agricultural practice using living organisms or their products to prevent or reduce loss or damage caused by pests on crops.
comment: Pratique agricole utilisant des organismes vivants ou leurs produits pour empêcher ou réduire les pertes ou dommages causés par des organismes nuisibles sur les cultures. @fr
label: Protection biologique @fr

Biological process
type: Class
subclass of: Process
comment: Plant growing process, sliced into different plant biological steps depending on bounds that are related to crop development stages.
comment: Processus de croissance des plantes, découpé en étapes en fontion de bornes relatives aux stades de développement des plantes. @fr
label: Processus biologique @fr

Broadcast planting process
type: Class
subclass of: Crop establishment
comment: Agricultural practice of crop layout by throwing seeds as envenly as possible on the whole area to sow.
comment: Pratique agricole de mise en place de la culture en projetant des graines aussi régulièrement que possible sur toute la surface à ensemencer. @fr
label: Implantation à la volée @fr

Burying
type: Class
subclass of: Crop destruction
comment: Agricultural practice related to the end of a production process, consisting of destroying the crop and then turning over the soil on the surfae to place deeper the crop residues or service plants from the soil surface.
comment: Pratique agricole liée à la fin d'un processus de production, consistant à détruire la culture puis à retourner le sol en surface pour placer les résidus de culture ou plantes de service plus en profondeur depuis la surface du sol. @fr
label: Enfouissement @fr

Chemical weeding
type: Class
subclass of: Weed control
comment: Agricultural practice of using chemicals to eliminate or limit the development of weeds to reduce their harmfulness to crops.
comment: Pratique agricole utilisant des produits chimiques consistant à éliminer ou à limiter le développement des adventices pour réduire leur nuisibilité sur les plantes cultivées. @fr
label: Désherbage chimique @fr

Climate context
type: Class
subclass of: Context
comment: Ensemble des caractéristiques climatiques concernant une exploitation ou un itinéraire technique. @fr
comment: Set of climate characteristics regarding a farm or a crop itinerary.
label: Contexte climatique @fr

Collection
type: Class
subclass of: Crop entity

Condition
type: Class
subclass of: Entity
comment: Critère obligatoire pour pouvoir exister. @fr
comment: Mandatory criterion to be able to exist.

Conservation
type: Class
subclass of: Farming practice
comment: Ensemble de pratiques agricoles post-récoltes réalisées dans le but de garder un produit agricole de manière à maintenir autant que possible sa quantité et sa qualité intactes avant sa distribution. @fr
comment: Set of agricultural post-harvest practices performed in order to keep an agricultural product as intact s possible in terms of quantity and quality before distribution.

Context
type: Class
subclass of: Entity
comment: Ensemble des caractéristiques environnementales et agronomiques décrivant la situation d'une exploitation ou d'un itinéraire technique. @fr
comment: Environmental and agronomic characteristics describing the situation of a farm or a crop itinerary.
label: Contexte @fr

Crop
type: Class
subclass of: Entity
comment: Cultivated plant, refering to a species or a varietal type.
comment: Plante cultivée, désignant une espèce ou un type variétal. @fr
label: Culture @fr

Crop cultivation
type: Class
subclass of: Farming practice
comment: All the tasks from the crop establishment to its destruction, in order to obtain an agricultural product or a service.
comment: Ensemble des tâches depuis l'implantation d'une culture jusqu'à sa destruction, dans le but d'obtenir un produit agricole ou un service. @fr
label: Conduite de culture @fr

Crop destruction
type: Class
subclass of: Farming practice
comment: Agricultural practice and final stage of a production process during which the unharvested part of the vegetal is destroyed: it can be left on the plot (buried or not) or exported.
comment: Pratique agricole et étape finale d'un processus de production pendant la partie non récoltée du végétal est détruite : elle peut être laissée à la parcelle (enfouie ou non) ou exportée. @fr
label: Destruction des cultures @fr

Crop entity
type: Class
subclass of: Entity
comment: An abstract class representing ontology practical classes.
comment: Classe abstraite représentant les entités fonctionnelles du module CropManagement. @fr
label: Entité de culture @fr

Crop itinerary
type: Class
subclass of: Procedure
subclass of: Restriction
  max cardinality: 1
  on property: depends on cultural context
subclass of: Restriction
  max cardinality: 1
  on property: depends on soil climate context
comment: Cultural process composed by a succession of technical operations in order to obtain an agricultural product or an agronomic service.
comment: Processus cultural constitué d'un enchaînement d'opérations techniques pour l'obtention d'un produit agricole ou d'un service agronomique. @fr
label: Itinéraire technique cultural @fr

Crop maintenance
type: Class
subclass of: Crop cultivation
comment: All the agricultural practice allowing good development of the crop until its harvest.
comment: Ensemble des pratiques agricoles permettant le bon développement de la culture jusqu'à sa récolte. @fr
label: Entretien de la culture @fr

Cultivable position
type: Class
subclass of: Entity
comment: Field placement of a serie.
comment: Placement d'une série sur un terrain de culture. @fr
label: Emplacement cultivable @fr

Cultural context
type: Class
subclass of: Context
comment: Désigne le type d'agriculture pratiquée ainsi que le niveau d'équipement de la ferme. @fr
comment: Refers to the type of agriculture practiced and the equipment level of the farm.
label: Contexte cultural @fr

Deep tillage
type: Class
subclass of: Soil tillage
comment: Agricultural tillage practice using various tools in order to improve the fertility of deep soil horizons.
comment: Pratique agricole de travail du sol utilisant divers outils dans le but d'améliorer la fertilité des horizons profonds du sol. @fr
label: Travail du sol en profondeur @fr

Defoliation
type: Class
subclass of: Growth control
comment: Agricultural practice consisting in detaching a certain number of leaves or petals from a plant.
comment: Pratique agricole consistant à détacher d'un végétal un certain nombre de feuilles ou de pétales. @fr
label: Effeuillage @fr

Bechage
type: Class
subclass of: Soil tillage with reversal
comment: Agricultural practice consisting in working the soil with a spade.
comment: Pratique agricole consistant à travailler la terre avec une bêche. @fr
label: Bêchage @fr

Drying
type: Class
subclass of: Conservation
comment: Agricultural conservation practice consisting of reducing water content of harvested products before distribution.
comment: Pratique agricole de conservation consistant à réduire la teneur en eau des produits récoltés avant distribution. @fr
label: Séchage @fr

Farming practice
type: Class
subclass of: Practice
comment: Agricultural task involving the crop or soil.
comment: Tâche agricole portant sur la culture ou le sol. @fr
label: Pratique agricole @fr

Fertilisation
type: Class
subclass of: Crop cultivation
comment: Agricultural practice of providing nutrient-laden inputs to maintain or increase the fertility of a soil in order to place crops in the best feeding conditions.
comment: Pratique agricole d'apport d'intrants chargés en nutriments afin de maintenir ou augmenter la fertilité d'un sol pour placer les plantes cultivées dans les meilleures conditions d'alimentation. @fr

Grinding
type: Class
subclass of: Crop destruction
comment: Agricultural crop destruction practice consisting of reducing the unharvested parts of the crop into very small fragments by pressure or shock.
comment: Pratique agricole de destruction de la culture consistant à réduire en fragments très petits les parties non récoltées de la culture par pression ou par choc. @fr
label: Broyage @fr

Growth control
type: Class
subclass of: Crop maintenance
comment: All the agricultural practices that influence part of the crop development, often with the goal of improving production.
comment: Ensemble des pratiques agricoles influençant une partie du développement de la culture, souvent dans le but d'améliorer la production. @fr
label: Contrôle de croissance @fr

Hand weeding
type: Class
subclass of: Weed control
comment: Agricultural practice of limiting the weeds development or their destruction by hand work.
comment: Pratique agricole de limitation du développement des adventices ou de leur destruction réalisée de manière manuelle. @fr
label: Désherbage manuel @fr

Harrowing
type: Class
subclass of: Surface tillage
comment: Agricultural soil tillage practice using a harrow to loosen the soil or for weed control.
comment: Pratique agricole de travail du sol utilisant une herse pour ameublir le sol ou désherber. @fr
label: Hersage @fr

Harvest
type: Class
subclass of: Farming practice
comment: Etape finale du processus de production d'une culture, pouvant être ou non l'étape finale du cycle de développement végétal de la plante, amenant à l'obtention du produit agricole recherché. Elle peut être réalisée en une seule fois ou en plusieurs passages selon la culture. @fr
comment: Final stage of the production process of a crop, which may or may not be the final stage of the plant's developpment cycle, leading to the desired agricultural product. It can be carried out in only one time or in several passages depending on the culture.
label: Récolte @fr

Haulm cutting
type: Class
subclass of: Crop maintenance
comment: Agricultural practice of partially or completely destroying the stems and/or leaves of a crop before its harvest.
comment: Pratique agricole consistant à détruire partiellement ou entièrement les tiges et/ou feuilles d'une culture avant sa récolte. @fr
label: Défanage @fr

Hoeing
type: Class
subclass of: Crop maintenance
comment: Agricultural practice using a hoe for weed control.
comment: Pratique agricole utilisant une bineuse pour désherber. @fr
label: Binage @fr

Irrigation
type: Class
subclass of: Crop cultivation
comment: All agricultural practices linked to the management of artificial water supplies for crops.
comment: Ensemble de pratiques agricoles liées à la gestion d'apports d'eau artificielle pour les cultures. @fr

Mechanical weeding
type: Class
subclass of: Weed control
comment: Agricultural weed control practice carried out with mechanical tools.
comment: Pratique agricole de désherbage réalisée avec des outils mécaniques. @fr
label: Désherbage mécanique @fr

Milling
type: Class
subclass of: Surface tillage
comment: Agricultural surface tillage pratice of plowing that cuases the grinding and mixing of surface soil layers.
comment: Pratique agricole de travail du sol superficiel de labourage qui provoque le broyage et le mélange des couches de sol surfaciques. @fr
label: Fraisage @fr

Mineral amendment
type: Class
subclass of: Soil amendment
comment: Agricultural soil amendment practice using mineral and non-organic amendments.
comment: Pratique agricole d'amendement du sol utilisant des amendements de nature minérale et non organique. @fr
label: Amendement minéral @fr

Mineral fertilisation
type: Class
subclass of: Fertilisation
comment: Agricultural fertilisation practice using mineral and non-organic fertilisers.
comment: Pratique agricole de fertilisation utilisant des fertilisants minéraux et non organiques. @fr
label: Fertilisation minérale @fr

Misc operation
type: Class
subclass of: Practice
comment: Non-agricultural practice.
comment: Pratique non agricole. @fr
label: Autre opération @fr

Mowing
type: Class
subclass of: Crop destruction
comment: Agricultural crop destruction practice using a scythe or a machine to cut of portion of the crop.
comment: Pratique agricole de destruction de la culture utilisant une faux ou une machine pour couper une partie de la culture. @fr
label: Fauchage @fr

Mulching
type: Class
subclass of: Crop maintenance
comment: Agricultural practice consisting in covering the soil with straw, mulch, plant waste or with a tarp or canvas, in order to manage diseases, weeds or water storage for the crop.
comment: Pratique agricole consistant à couvrir le sol de paille, mulch, déchets végétaux ou avec une bâche ou une toile, afin de gérer les maladies, les adventices ou le stockage de l'eau pour la culture. @fr
label: Paillage @fr

Nursery seeding
type: Class
comment: Semis de la culture en conditions environnementales contrôlées avant son repiquage sur la parcelle. @fr
comment: Sowing of the crop under controlled environmental conditions before transplanting it on the plot.
label: Semis pépinière @fr

Observation
type: Class
subclass of: Entity
comment: Note prise par un utilisateur. @fr
comment: Note taken by a user.

Operation
type: Class
subclass of: Crop entity
subclass of: Restriction
  cardinality: 1
  on property: has operation distance
label: Opération @fr

Distance between operations
type: Class
subclass of: Entity
comment: Intervalle de temps entre deux tâches agricoles. @fr
comment: Time interval between two agricultural tasks.
label: Distance entre opérations @fr

Operation task
type: Class
subclass of: Operation
label: Tâche opérationelle @fr

Organic amendment
type: Class
subclass of: Soil amendment
comment: Agricultural soil amendment practice using organic and non-mineral amendments.
comment: Pratique agricole d'amendement du sol utilisant des amendements de nature organique et non minérale. @fr
label: Amendement organique @fr

Organic fertilisation
type: Class
subclass of: Fertilisation
comment: Agricultural fertilisation practice using organic and non-mineral fertilisers.
comment: Pratique agricole de fertilisation utilisant des fertilisants organiques et non minéraux. @fr
label: Fertilisation organique @fr

Packaging
type: Class
subclass of: Conservation
comment: Agricultural conservation practice consisting in putting agricultural products in a package to isolate it from its environment, to protect it, to conserve it, transport it or to showcase it for distribution.
comment: Pratique agricole de conservation consistant à mettre les produits agricoles dans un emballage pour l'isoler de son environnement, le protéger, le conserver, le transporter ou pour le mettre en valeur en vue de leur distribution. @fr
label: Empactage @fr

Physical protection
type: Class
subclass of: Plant protection
comment: Agricultural crop protection practice using physical means.
comment: Pratique agricole de protection des cultures utilisant des moyens physiques. @fr
label: Protection physique @fr

Phytosanitary protection
type: Class
subclass of: Plant protection
comment: Agricultural practice of using a chemical or biological substance or mixture of substances to protect crops and stored agricultural products from pests.
comment: Pratique agricole utilisant une substance ou un mélange de substances de nature chimique ou biologique pour protéger les plantes cultivées et les produits agricoles stockés contre les bioagresseurs. @fr
label: Protection phytosanitaire @fr

Pinching
type: Class
subclass of: Growth control
comment: Agricultural crop growth control practice that consist of impeding sap flow by cutting off the tip of a bud.
comment: Pratique agricole de contrôle de croissance de la culture consistant à entraver la montée des sèves en sectionnant l'extrémité d'un bourgeon. @fr
label: Pincement @fr

Plant descent
type: Class
subclass of: Plant training
comment: Agricultural practice of plant management consisting in lowering the level of certain crops that are maintained in height.
comment: Pratique agricole de conduite de la plante consistant à abaisser le niveau de certaines cultures qui sont maintenues en hauteur. @fr
label: Descente plante @fr

Plant material
type: Class
subclass of: Resource
comment: Nature de l'organe végétal utilisé pour la mise en place d'une culture, pouvant s'agir d'une graine ou d'un plant. @fr
comment: Nature of the plant organ used for establishment of a crop, which can be a seed or a plant.
label: Matériel végétal @fr

Plant protection
type: Class
subclass of: Crop cultivation
comment: Agricultural practice related to the control of pests to reduce crop damage or loss.
comment: Pratique agricole liée à la lutte contre des organismes nuisibles pour réduire les dommages ou pertes des cultures. @fr
label: Protection des plantes @fr

Plant training
type: Class
subclass of: Crop maintenance
comment: All agricultural practices of managing the physical attitude of the plant.
comment: Ensemble des pratiques agricoles consistant à gérer le port de la plante. @fr
label: Conduite de la plante @fr

Planting
type: Class
subclass of: Row layout
comment: Agricultural practice of crop establishment from already formed plants, either from seeds on the farm or purchased.
comment: Pratique agricole de mise en place de la culture à partir de plants déjà formés, soit à partir de graines sur l'exploitation même, soit achetés. @fr
label: Plantation @fr

Crop establishment
type: Class
subclass of: Farming practice
comment: All actions that concerning the crop establishment.
comment: Ensemble des actions concernant la mise en place de la culture. @fr
label: Implantation @fr

Planting stock
type: Class
subclass of: Plant material
comment: Matériel végétal désignant une jeune plante formée à partir d'une graine et destinée à être plantée. @fr
comment: Plant materiel designating a young plant formed from a seed and intended for planting.
label: Plant @fr

Plowing
type: Class
subclass of: Soil tillage with reversal
comment: Agricultural soil tillage practice consisting in opening and turning over the soil more or less deelply to favour the good development of the crop.
comment: Pratique agricole de travail du sol consistant à ouvrir et retourner le sol plus ou moins en profondeur pour favoriser le bon développement de la culture. @fr
label: Labour @fr

Practice
type: Class
subclass of: Entity
comment: Task carried out on the farm, that may be agricultural or not.
comment: Tâche réalisée sur l'exploitation, pouvant être à caractère agricole ou non. @fr
label: Pratique @fr

Disbudding
type: Class
subclass of: Growth control
comment: Agricultural growth control practice consisting in removing superfluous buds from a crop.
comment: Pratique agricole de contrôle de croissance consistant à supprimer les bourgeons superflus d'une culture. @fr
label: Ebourgeonnage @fr

Procedure
type: Class
subclass of: Collection
label: Procédure @fr

Process
type: Class
subclass of: Collection
comment: Ensemble d'étapes constituant une méthode pour aboutir à un résultat recherché. @fr
comment: Set of steps composing a method to achieve a desired result.
label: Processus @fr

Production process
type: Class
subclass of: Process
comment: Processus de génération d'une production végétale découpé en une ou plusieurs séries, elles-mêmes composées de tâches opérationnelles. @fr
comment: Vegetal production generation process sliced into one or more series, themselves composed by operational tasks.
label: Processus de production @fr

Pruning
type: Class
subclass of: Growth control
comment: Agricultural growth control practice consisting in removing some living or dead parts of a crop to preserve its appearance and health, and to regulate its growth.
comment: Pratique agricole de contrôle de croissance consistant à enlever certaines parties vivantes ou mortes d'une culture pour préserver son apparence et sa santé, et régulariser sa croissance. @fr
label: Taille @fr

Pruning bouquet
type: Class
subclass of: Growth control
comment: Agricultural growth control practice of either removing fruit to present a more even fruit cluster, or removing fruit clusters to promote the growth of others.
comment: Pratique agricole de contrôle de croissance consistant soit à enlever des fruits pour présenter une grappe de fruits plus réguliers, soit à retirer des grappes de fruits pour favoriser la croissance des autres. @fr
label: Taille des bouquets @fr

Irrigation installation
type: Class
subclass of: Irrigation
comment: Establishment of irrigation water distribution systems for crops.
comment: Mise en place des systèmes de distribution d'eau d'irrigation pour les cultures. @fr
label: Installation de l'irrigation @fr

Put occulting cover
type: Class
subclass of: Soil remediation
comment: Agricultural practice of soil remediation $consisting in covering the soil with an opaque cloth after having prepared the soil, in order to provoke the germination then the death by lack of light of the weeds under the cloth.
comment: Pratique agricole d'assainissement du sol consistant à le couvrir avec une toile opaque après avoir préparé le sol, afin de provoquer la germination puis la mort par manque de lumière des adventices en dessous de la toile. @fr
label: Pose occulting cover @fr

Protective net installation
type: Class
subclass of: Physical protection
comment: Agricultural practice of protecting crops by placing a protective net over cultivated areas to limit crop damage.
comment: Pratique agricole de protection des cultures consistant à déposer sur les zones cultivées des filets protecteurs pour limiter les dommages causés sur les cultures. @fr
label: Pose du filet @fr

Trellising installation
type: Class
subclass of: Plant training
comment: Agricultural practice of guiding the plant's development by placing structures on which the stems and branches are attached with ties.
comment: Pratique agricole de conduite de la plante consistant à guider son développement par la pose de structures sur lesquelles on vient attacher ses tiges et branches à l'aide de liens. @fr
label: Installation du palissage @fr

Put wintering cover
type: Class
subclass of: Physical protection
comment: Agricultural practice of crop protection consisting in depositing on the cultivated area a thermal fabric to protect the crops from the cold.
comment: Pratique agricole de protection des cultures consistant à déposer sur la zone cultivée un tissu thermique pour protéger les cultures contre le froid. @fr
label: Pose du voile d’hivernage @fr

Put woven fabrics
type: Class
subclass of: Mulching
comment: Agricultural mulching practice using plastic covers made by interlacing strips to increase the strength and permeability of the material.
comment: Pratique agricole de paillage utilisant des couvertures plastiques fabriquées en entrelaçant des bandelettes afin d'augmenter la résistance et la perméabilité du matériel. @fr
label: Pose toile tissée @fr

Irrigation removal
type: Class
subclass of: Irrigation
comment: Removing of irrigation water distribution systems for crops.
comment: Retrait des systèmes de distribution d'eau d'irrigation pour les cultures. @fr
label: Désinstallation de l'irrigation @fr

Remove occulting cover
type: Class
subclass of: Soil remediation
comment: Agricultural mulching practice of removing the opaque cloth from an area to be cultivated after a sufficient time to have had an effect on weeds.
comment: Pratique agricole de paillage consistant à retirer la bâche opaque d'une zone à cultiver après une durée suffisante pour avoir eu un effet sur les adventices. @fr
label: Retrait bâche occultante @fr

Protective net removal
type: Class
subclass of: Physical protection
comment: Agricultural practice of crop protection consisting in removing the protective net from the cultivated areas.
comment: Pratique agricole de protection des cultures consistant à retirer des zones cultivées le filet protecteur. @fr
label: Retrait du filet @fr

Trellising removal
type: Class
subclass of: Plant training
comment: Agricultural practice of plant management consisting in removing the structures used to guide the development of the crop.
comment: Pratique agricole de conduite de la plante consistant à retirer les structures servant à guider le développement de la culture. @fr
label: Démontage du palissage @fr

Remove wintering cover
type: Class
subclass of: Physical protection
comment: Agricultural crop protection practice of removing thermal fabric from the cultivated area once the cold is no longer a risk to the crop.
comment: Pratique agricole de protection des cultures consistant à retirer de la zone cultivée le tissu thermique une fois que le froid n'est plus un risque pour les cultures. @fr
label: Retrait du voile d’hivernage @fr

Remove woven fabrics
type: Class
subclass of: Mulching
comment: Agricultural mulching practice of removing the previously used woven fabric from the cultivable area.
comment: Pratique agricole de paillage consistant à retirer de la zone cultivable la toile tissée utilisée précédemment. @fr
label: Retrait toile tissée @fr

Resource
type: Class
subclass of: Entity
label: Ressource @fr

Ridging
type: Class
subclass of: Crop cultivation
subclass of: Surface tillage
comment: Agricultural practice of superficial tillage consisting of bringing the soil from the planting intervals to the foot of the crop.
comment: Pratique agricole de travail du sol superficiel consistant à ramener la terre se trouvant dans les intervalles de plantation au pied de la culture. @fr
label: Buttage @fr

Rolling
type: Class
subclass of: Crop destruction
comment: Agricultural practice using a roller that will be used either on the ground to level it, or on a crop to lay it down and destroy it without disturbing the soil, thus allowing not to re-sprout weeds.
comment: Pratique agricole utilisant un rouleau qui va être utilisé soit sur le sol pour l'aplanir, soit sur une culture pour la coucher et la détruire sans perturber le sol, permettant ainsi de ne pas relancer une germination des adventices. @fr
label: Roulage @fr

Row layout
type: Class
subclass of: Crop establishment
comment: Practice of crop layout in a linear manner following a furrow.
comment: Pratique de mise en place de la culture de manière linéaire en suivant un sillon. @fr
label: Implantation en ligne @fr

Seed
type: Class
subclass of: Plant material
comment: Matériel végétal désignant une semence destinée à être semée en pépinière ou sur la zone cultivable directement. @fr
comment: Plant materiel designating a seed intended to be sown in a sursery or on the cultivable area directly.
label: Graine @fr

Seedbed preparation
type: Class
subclass of: Surface tillage
comment: Agricultural practice of tilling the soil with machinery before the crop establishment in order to create a favorable structure to the emergence and good development of the crop.
comment: Pratique agricole de travail du sol utilisant des machines sur le sol avant l'implantation d'une culture dans le but de créer une structure favorable à la levée et à un bon développement de la culture. @fr
label: Préparation du lit de semence @fr

Seed drilling
type: Class
subclass of: Row layout
comment: Agricultural practice of crop establishment from seeds arranged in a linear manner following a furrow.
comment: Pratique agricole de mise en place de la culture à partir de graines disposées de manière linéaire en suivant un sillon. @fr
label: Semis en ligne @fr

Series
type: Class
subclass of: Procedure
comment: Désigne une des divisions du processus de production d'une culture donnée : implantation de cette culture à des dates successives, pour allonger la période de production de ce produit. @fr
comment: Refers to one of the divisions of the production process of a given crop: establishment of this crop at successive dates, in order to extend the production period of this product.
label: Série @fr

Soil amendment
type: Class
subclass of: Soil preparation
comment: Fertilization practice providing a nutrient product designed to improve the properties (physical, chemical and biological) of the soil, by adding limestone or organic matter.
comment: Pratique agricole de fertilisation apportant un produit nutritif destiné à améliorer les propriétés (physiques, chimiques et biologiques) du sol, par l’apport de calcaire ou de matières organiques. @fr
label: Amendement du sol @fr

Soil remediation
type: Class
subclass of: Soil preparation
comment: All the agricultural practices consisting in improving the global sanitary situation of the soil to favour the good development of the following crops.
comment: Ensemble des pratiques agricoles consistant à améliorer la situation sanitaire globale du sol pour favoriser le bon développement des cultures suivantes. @fr
label: Assainissement du sol @fr

Soil and climate context
type: Class
subclass of: Context
comment: All the characteristics of the soil and the climate contextualizing a plot or a production cell.
comment: Ensemble des caractéristiques du sol et du climat contextualisant une parcelle ou un îlot. @fr
label: Contexte pédoclimatique @fr

Soil context
type: Class
subclass of: Context
comment: Ensemble des caractéristiques pédologiques concernant une exploitation ou un itinéraire technique. @fr
comment: Set of pedological characteristics regarding a farm or a crop itinerary.
label: Contexte du sol @fr

Soil decompacting
type: Class
subclass of: Soil tillage without reversal
comment: Agricultural deep tillage practice using a decompactor to aerate overly compated soils and break up potential plow footings without turning over the soil.
comment: Pratique agricole de travail du sol profond utilisant un décompacteur pour aérer les sols trop compactés et casser les potentielles semelles de labour sans retournement du sol. @fr
label: Décompactage @fr

Soil preparation
type: Class
subclass of: Farming practice
comment: All agricultural practices related to the creation, at the soil level, of a favorable environment for the establishment of a crop.
comment: Ensemble des pratiques agricoles liées à la création, au niveau du sol, d'un environnement favorable à l'implantation d'une culture. @fr
label: Préparation sol @fr

Soil tillage
type: Class
subclass of: Soil preparation
comment: Agricultural practice using various tools in order to create a favorable environment for crop development in the soil.
comment: Pratique agricole utilisant divers outils dans le but de créer dans le sol un milieu favorable au développement des cultures. @fr
label: Travail du sol @fr

Soil solarization
type: Class
subclass of: Soil remediation
comment: Agricultural practice of soil sanitation consisting in covering the soil with a transparent cloth in order to make weeds emerge and then to destroy them thanks to the temperature increase under the tarpaulin.
comment: Pratique agricole d'assainissement du sol consistant à le couvrir avec une toile transparente afin faire lever les adventices puis de les détruire grâce à l'augmentation de température sous la bâche. @fr
label: Solarisation @fr

Stale seed bed
type: Class
subclass of: Soil remediation
comment: Agricultural practice of soil sanitation consisting of preparing a seedbed, allowing weeds to emerge and then weeding without disturbing the soil before planting the crop.
comment: Pratique agricole d'assainissement du sol consistant à préparer un lit de semence, à laisser les adventices lever puis à effectuer un désherbage sans perturbation du sol avant d'implanter la culture. @fr
label: Faux semis @fr

Steam disinfection
type: Class
subclass of: Soil remediation
comment: Agricultural practice of soil sanitation using a means of thermal control by raising the temperature up to 90 °C via the injection of steam into the soil to disinfect its surface layers.
comment: Pratique agricole d'assainissement du sol utilisant un moyen de lutte thermique en élevant la température jusq'à 90 °C via l'injection de vapeur d'eau dans le sol pour désinfecter les couches superficielles de celui-ci. @fr
label: Désinfection à la vapeur @fr

Stone burrying
type: Class
subclass of: Soil tillage with reversal
comment: Agricultural practice of deep tillage with turning over to bury surface stones deep into the soil to prepare it for crop establishment.
comment: Pratique agricole de travail du sol profond avec retournement qui permet d'enfouir les cailloux de surface en profondeur dans le sol pour le préparer à l'implantation de la culture. @fr
label: Enfouissage de pierres @fr

Storage
type: Class
subclass of: Conservation
comment: Agricultural post-harvest conservation practice related to the conservation of an agricultural product, consisting of storing for a given period according to standards and rules that allow its proper conservation before distribution.
comment: Pratique agricole post-récolte de conservation liée à la conservation d'un produit agricole, consistant à l'entreposer pour une période donnée suivant des normes et règles qui permettent sa bonne conservation avant distribution. @fr
label: Stockage @fr

Stubble ploughing
type: Class
subclass of: Surface tillage
comment: Agricultural practice of superficial tillage consisting of burying stubble and crop remains to promote their decomposition.
comment: Pratique agricole de travail du sol superficiel consistant à enfouir les chaumes et restes de cultures afin de favoriser leur décomposition. @fr
label: Déchaumage @fr

Subsoiling
type: Class
subclass of: Soil tillage without reversal
comment: Agricultural practice of deep tillage using a subsoiler to break up or loosen a compact layer of soil without turning it over to a depth greater than that of plowing.
comment: Pratique agricole de travail du sol profond utilisant une sous-soleuse visant à briser ou ameublir sans retournement une couche compacte du sol à une profondeur supérieure à celle des labours. @fr
label: Sous solage @fr

Surface tillage
type: Class
subclass of: Soil tillage
comment: Agricultural tillage practice using various tools on the surface without disturbing the deep soil horizons.
comment: Pratique agricole de travail du sol utilisant divers outils en surface sans perturber les horizons profonds du sol. @fr
label: Travail du sol superficiel @fr

Technical operation
type: Class
subclass of: Operation
comment: Agricultural task that may or may not belong to a crop itinary, concerning the crops, the plot or the facilities of the farm.
comment: Tâche agricole pouvant appartenir à un itinéraire de culture ou non, portant sur les cultures, la parcelle ou les installations de l'exploitation. @fr
label: Opération technique @fr

Thermal weeding
type: Class
subclass of: Weed control
comment: Agricultural weed control practice carried out with thermal means.
comment: Pratique agricole de désherbage réalisée via des moyens thermiques. @fr
label: Désherbage thermique @fr

Thinning
type: Class
subclass of: Weed control
comment: Agricultural growth control practice consisting of removing plants from a seedling, fruits from a plant etc... to promote the growth of others.
comment: Pratique agricole de contrôle de croissance consistant à supprimer les plants d'un semis, des fruits d'un plant etc... pour favoriser la croissance des autres. @fr
label: Éclaircissage @fr

Topping
type: Class
subclass of: Growth control
comment: Agricultural growth control practice of eliminating the terminal bud to promote lateral bud development or accelerate fruit development and ripening.
comment: Pratique agricole de contrôle de croissance consistant à éliminer le bourgeon terminal pour favoriser le développement des bourgeons latéraux ou accélérer le développement et la maturation des fruits. @fr
label: Étêtage @fr

Trellising
type: Class
subclass of: Plant training
comment: Structure permettant d'attacher les tiges et branches d'une culture à l'aide de liens, pour les orienter dans une direction déterminée, dans le but d'en améliorer la qualité et le rendement. @fr
comment: Structure used to tie the stems and branches of a crop to orient them in a specific direction in order to improve quality and yield.
label: Palissage @fr

Washing
type: Class
subclass of: Conservation
comment: Agricultural conservation practice that involves running water over harvested produce to improve preservation and reduce health risks.
comment: Pratique agricole de conservation consistant à passer de l'eau sur les produits récoltés pour en améliorer la conservation et réduire les risques sanitaires. @fr
label: Lavage @fr

Watering
type: Class
subclass of: Irrigation
comment: Agricultural practice consisting of artificial water supply on crops to improve the productivity or to compensate a water deficit.
comment: Pratique agricole d'apport artificiel d'eau à des cultures pour en améliorer la productivité ou combler un déficit d'eau. @fr
label: Arrosage @fr

Weed control
type: Class
subclass of: Crop maintenance
comment: Agricultural practice of eliminating or limiting the development of weeds to reduce their harmfulness to crops.
comment: Pratique agricole consistant à éliminer ou à limiter le développement des adventices pour réduire leur nuisibilité sur les plantes cultivées. @fr
label: Maîtrise de l'enherbement @fr

Soil tillage with reversal
type: Class
subclass of: Deep tillage
comment: Agricultural soil tillage practice using tools that turn over soil horizons.
comment: Pratique agricole de travail du sol utilisant des outils qui retournent les horizons de sol. @fr
label: Travail du sol avec retournement @fr

Soil tillage without reversal
type: Class
subclass of: Deep tillage
comment: Agricultural practice of working the soil with machines without turning it over.
comment: Pratique agricole consistant à travailler le sol avec des machines sans le retourner. @fr
label: Travail du sol sans retournement @fr

Put biodegradable plastic mulch
comment: Agricultural practice of mulching using tarpaulins or sheets of plastic materials that must be able to decompose in a short time under agricultural conditions.
comment: Pratique agricole de paillage utilisant des bâches ou toiles en matériaux plastiques qui doivent pouvoir se décomposer en un temps court en conditions agricoles. @fr
label: Pose paillage plastique biodégradable @fr

Put plastic mulch
comment: Agricultural practice of mulching using tarpaulins or sheets of plastic materials.
comment: Pratique agricole de paillage utilisant des bâches ou toiles en matériaux plastiques. @fr
label: Installation paillage plastique @fr

Put vegetal mulch
comment: Agricultural practice of mulching using plant materials to cover the soil.
comment: Pratique agricole de paillage utilisant des matériaux d'origine végétale pour couvrir le sol. @fr
label: Installation paillage végétal @fr

Remove biodegradable plastic mulch
comment: Agricultural mulching practice of removing biodegradable plastic covers from the soil.
comment: Pratique agricole de paillage consistant à retirer les couvertures en plastique biodégradable du sol. @fr
label: Retrait paillage plastique biodégradable @fr

Remove plastic mulch
comment: Agricultural mulching practice of removing plastic covers from the soil.
comment: Pratique agricole de paillage consistant à retirer les couvertures en plastique du sol. @fr
label: Retrait paillage plastique @fr

Remove vegetal mulch
comment: Agricultural mulching practice of removing vegetal covers from the soil.
comment: Pratique agricole de paillage consistant à retirer les couvertures d'origine végétale du sol. @fr
label: Retrait paillage végétal @fr

average germination rate
label: taux de levée moyen @fr