Crop itinerary description of the 'crop planification and production process' ontology
type: Ontology
contributor: Baptiste Darnala
contributor: Florence Amardeilh
creator: Elzeard
description: Ontology code created by Chowlk
comment: Created by Elzeard, crop planification and production process ontology represents general informations about agroecological vegetable production. This module is about the crop itinerary description.
version info: 1.0

Activity
type: Class
comment: Carrying out a technical operation by one person on a plot at a given time.
comment: Réalisation d'une opération technique par une personne sur une parcelle à un moment donné. @fr
label: Intervention @fr
subclass of: Operation

Biological plant protection
type: Class
comment: Agricultural practice using living organisms or their products to prevent or reduce loss or damage caused by pests on crops.
comment: Pratique agricole utilisant des organismes vivants ou leurs produits pour empêcher ou réduire les pertes ou dommages causés par des organismes nuisibles sur les cultures. @fr
label: Protection biologique @fr
subclass of: Plant protection

Biological process
type: Class
comment: Plant growing process, sliced into different plant biological steps depending on bounds that are related to crop development stages.
comment: Processus de croissance des plantes, découpé en étapes en fontion de bornes relatives aux stades de développement des plantes. @fr
label: Processus biologique @fr
subclass of: Process

Broadcast planting process
type: Class
comment: Agricultural practice of crop layout by throwing seeds as envenly as possible on the whole area to sow.
comment: Pratique agricole de mise en place de la culture en projetant des graines aussi régulièrement que possible sur toute la surface à ensemencer. @fr
label: Implantation à la volée @fr
subclass of: Crop establishment

Burying
type: Class
comment: Agricultural practice related to the end of a production process, consisting of destroying the crop and then turning over the soil on the surfae to place deeper the crop residues or service plants from the soil surface.
comment: Pratique agricole liée à la fin d'un processus de production, consistant à détruire la culture puis à retourner le sol en surface pour placer les résidus de culture ou plantes de service plus en profondeur depuis la surface du sol. @fr
label: Enfouissement @fr
subclass of: Crop destruction

Chemical weeding
type: Class
comment: Agricultural practice of using chemicals to eliminate or limit the development of weeds to reduce their harmfulness to crops.
comment: Pratique agricole utilisant des produits chimiques consistant à éliminer ou à limiter le développement des adventices pour réduire leur nuisibilité sur les plantes cultivées. @fr
label: Désherbage chimique @fr
subclass of: Weed control

Climate context
type: Class
comment: Ensemble des caractéristiques climatiques concernant une exploitation ou un itinéraire technique. @fr
comment: Set of climate characteristics regarding a farm or a crop itinerary.
label: Contexte climatique @fr
subclass of: Context

Collection
type: Class
subclass of: Crop entity

Condition
type: Class
comment: Critère obligatoire pour pouvoir exister. @fr
comment: Mandatory criterion to be able to exist.
subclass of: Entity

Conservation
type: Class
comment: Ensemble de pratiques agricoles post-récoltes réalisées dans le but de garder un produit agricole de manière à maintenir autant que possible sa quantité et sa qualité intactes avant sa distribution. @fr
comment: Set of agricultural post-harvest practices performed in order to keep an agricultural product as intact s possible in terms of quantity and quality before distribution.
subclass of: Farming practice

Context
type: Class
comment: Ensemble des caractéristiques environnementales et agronomiques décrivant la situation d'une exploitation ou d'un itinéraire technique. @fr
comment: Environmental and agronomic characteristics describing the situation of a farm or a crop itinerary.
label: Contexte @fr
subclass of: Entity

Crop
type: Class
comment: Cultivated plant, refering to a species or a varietal type.
comment: Plante cultivée, désignant une espèce ou un type variétal. @fr
label: Culture @fr
subclass of: Entity

Crop cultivation
type: Class
comment: All the tasks from the crop establishment to its destruction, in order to obtain an agricultural product or a service.
comment: Ensemble des tâches depuis l'implantation d'une culture jusqu'à sa destruction, dans le but d'obtenir un produit agricole ou un service. @fr
label: Conduite de culture @fr
subclass of: Farming practice

Crop destruction
type: Class
comment: Agricultural practice and final stage of a production process during which the unharvested part of the vegetal is destroyed: it can be left on the plot (buried or not) or exported.
comment: Pratique agricole et étape finale d'un processus de production pendant la partie non récoltée du végétal est détruite : elle peut être laissée à la parcelle (enfouie ou non) ou exportée. @fr
label: Destruction des cultures @fr
subclass of: Farming practice

Crop entity
type: Class
comment: An abstract class representing ontology practical classes.
comment: Classe abstraite représentant les entités fonctionnelles du module CropManagement. @fr
label: Entité de culture @fr
subclass of: Entity

Crop itinerary
type: Class
comment: Cultural process composed by a succession of technical operations in order to obtain an agricultural product or an agronomic service.
comment: Processus cultural constitué d'un enchaînement d'opérations techniques pour l'obtention d'un produit agricole ou d'un service agronomique. @fr
label: Itinéraire technique cultural @fr
subclass of: Procedure
subclass of: Restriction
  max cardinality: 1
  on property: depends on cultural context
subclass of: Restriction
  max cardinality: 1
  on property: depends on soil climate context

Crop maintenance
type: Class
comment: All the agricultural practice allowing good development of the crop until its harvest.
comment: Ensemble des pratiques agricoles permettant le bon développement de la culture jusqu'à sa récolte. @fr
label: Entretien de la culture @fr
subclass of: Crop cultivation

Cultivable position
type: Class
comment: Field placement of a serie.
comment: Placement d'une série sur un terrain de culture. @fr
label: Emplacement cultivable @fr
subclass of: Entity

Cultural context
type: Class
comment: Désigne le type d'agriculture pratiquée ainsi que le niveau d'équipement de la ferme. @fr
comment: Refers to the type of agriculture practiced and the equipment level of the farm.
label: Contexte cultural @fr
subclass of: Context

Deep tillage
type: Class
comment: Agricultural tillage practice using various tools in order to improve the fertility of deep soil horizons.
comment: Pratique agricole de travail du sol utilisant divers outils dans le but d'améliorer la fertilité des horizons profonds du sol. @fr
label: Travail du sol en profondeur @fr
subclass of: Soil tillage

Defoliation
type: Class
comment: Agricultural practice consisting in detaching a certain number of leaves or petals from a plant.
comment: Pratique agricole consistant à détacher d'un végétal un certain nombre de feuilles ou de pétales. @fr
label: Effeuillage @fr
subclass of: Growth control

Bechage
type: Class
comment: Agricultural practice consisting in working the soil with a spade.
comment: Pratique agricole consistant à travailler la terre avec une bêche. @fr
label: Bêchage @fr
subclass of: Soil tillage with reversal

Drying
type: Class
comment: Agricultural conservation practice consisting of reducing water content of harvested products before distribution.
comment: Pratique agricole de conservation consistant à réduire la teneur en eau des produits récoltés avant distribution. @fr
label: Séchage @fr
subclass of: Conservation

Farming practice
type: Class
comment: Agricultural task involving the crop or soil.
comment: Tâche agricole portant sur la culture ou le sol. @fr
label: Pratique agricole @fr
subclass of: Practice

Fertilisation
type: Class
comment: Agricultural practice of providing nutrient-laden inputs to maintain or increase the fertility of a soil in order to place crops in the best feeding conditions.
comment: Pratique agricole d'apport d'intrants chargés en nutriments afin de maintenir ou augmenter la fertilité d'un sol pour placer les plantes cultivées dans les meilleures conditions d'alimentation. @fr
subclass of: Crop cultivation

Grinding
type: Class
comment: Agricultural crop destruction practice consisting of reducing the unharvested parts of the crop into very small fragments by pressure or shock.
comment: Pratique agricole de destruction de la culture consistant à réduire en fragments très petits les parties non récoltées de la culture par pression ou par choc. @fr
label: Broyage @fr
subclass of: Crop destruction

Growth control
type: Class
comment: All the agricultural practices that influence part of the crop development, often with the goal of improving production.
comment: Ensemble des pratiques agricoles influençant une partie du développement de la culture, souvent dans le but d'améliorer la production. @fr
label: Contrôle de croissance @fr
subclass of: Crop maintenance

Hand weeding
type: Class
comment: Agricultural practice of limiting the weeds development or their destruction by hand work.
comment: Pratique agricole de limitation du développement des adventices ou de leur destruction réalisée de manière manuelle. @fr
label: Désherbage manuel @fr
subclass of: Weed control

Harrowing
type: Class
comment: Agricultural soil tillage practice using a harrow to loosen the soil or for weed control.
comment: Pratique agricole de travail du sol utilisant une herse pour ameublir le sol ou désherber. @fr
label: Hersage @fr
subclass of: Surface tillage

Harvest
type: Class
comment: Etape finale du processus de production d'une culture, pouvant être ou non l'étape finale du cycle de développement végétal de la plante, amenant à l'obtention du produit agricole recherché. Elle peut être réalisée en une seule fois ou en plusieurs passages selon la culture. @fr
comment: Final stage of the production process of a crop, which may or may not be the final stage of the plant's developpment cycle, leading to the desired agricultural product. It can be carried out in only one time or in several passages depending on the culture.
label: Récolte @fr
subclass of: Farming practice

Haulm cutting
type: Class
comment: Agricultural practice of partially or completely destroying the stems and/or leaves of a crop before its harvest.
comment: Pratique agricole consistant à détruire partiellement ou entièrement les tiges et/ou feuilles d'une culture avant sa récolte. @fr
label: Défanage @fr
subclass of: Crop maintenance

Hoeing
type: Class
comment: Agricultural practice using a hoe for weed control.
comment: Pratique agricole utilisant une bineuse pour désherber. @fr
label: Binage @fr
subclass of: Crop maintenance

Irrigation
type: Class
comment: All agricultural practices linked to the management of artificial water supplies for crops.
comment: Ensemble de pratiques agricoles liées à la gestion d'apports d'eau artificielle pour les cultures. @fr
subclass of: Crop cultivation

Mechanical weeding
type: Class
comment: Agricultural weed control practice carried out with mechanical tools.
comment: Pratique agricole de désherbage réalisée avec des outils mécaniques. @fr
label: Désherbage mécanique @fr
subclass of: Weed control

Milling
type: Class
comment: Agricultural surface tillage pratice of plowing that cuases the grinding and mixing of surface soil layers.
comment: Pratique agricole de travail du sol superficiel de labourage qui provoque le broyage et le mélange des couches de sol surfaciques. @fr
label: Fraisage @fr
subclass of: Surface tillage

Mineral amendment
type: Class
comment: Agricultural soil amendment practice using mineral and non-organic amendments.
comment: Pratique agricole d'amendement du sol utilisant des amendements de nature minérale et non organique. @fr
label: Amendement minéral @fr
subclass of: Soil amendment

Mineral fertilisation
type: Class
comment: Agricultural fertilisation practice using mineral and non-organic fertilisers.
comment: Pratique agricole de fertilisation utilisant des fertilisants minéraux et non organiques. @fr
label: Fertilisation minérale @fr
subclass of: Fertilisation

Misc operation
type: Class
comment: Non-agricultural practice.
comment: Pratique non agricole. @fr
label: Autre opération @fr
subclass of: Practice

Mowing
type: Class
comment: Agricultural crop destruction practice using a scythe or a machine to cut of portion of the crop.
comment: Pratique agricole de destruction de la culture utilisant une faux ou une machine pour couper une partie de la culture. @fr
label: Fauchage @fr
subclass of: Crop destruction

Mulching
type: Class
comment: Agricultural practice consisting in covering the soil with straw, mulch, plant waste or with a tarp or canvas, in order to manage diseases, weeds or water storage for the crop.
comment: Pratique agricole consistant à couvrir le sol de paille, mulch, déchets végétaux ou avec une bâche ou une toile, afin de gérer les maladies, les adventices ou le stockage de l'eau pour la culture. @fr
label: Paillage @fr
subclass of: Crop maintenance

Nursery seeding
type: Class
comment: Semis de la culture en conditions environnementales contrôlées avant son repiquage sur la parcelle. @fr
comment: Sowing of the crop under controlled environmental conditions before transplanting it on the plot.
label: Semis pépinière @fr

Observation
type: Class
comment: Note prise par un utilisateur. @fr
comment: Note taken by a user.
subclass of: Entity

Operation
type: Class
label: Opération @fr
subclass of: Crop entity
subclass of: Restriction
  cardinality: 1
  on property: has operation distance

Distance between operations
type: Class
comment: Intervalle de temps entre deux tâches agricoles. @fr
comment: Time interval between two agricultural tasks.
label: Distance entre opérations @fr
subclass of: Entity

Operation task
type: Class
label: Tâche opérationelle @fr
subclass of: Operation

Organic amendment
type: Class
comment: Agricultural soil amendment practice using organic and non-mineral amendments.
comment: Pratique agricole d'amendement du sol utilisant des amendements de nature organique et non minérale. @fr
label: Amendement organique @fr
subclass of: Soil amendment

Organic fertilisation
type: Class
comment: Agricultural fertilisation practice using organic and non-mineral fertilisers.
comment: Pratique agricole de fertilisation utilisant des fertilisants organiques et non minéraux. @fr
label: Fertilisation organique @fr
subclass of: Fertilisation

Packaging
type: Class
comment: Agricultural conservation practice consisting in putting agricultural products in a package to isolate it from its environment, to protect it, to conserve it, transport it or to showcase it for distribution.
comment: Pratique agricole de conservation consistant à mettre les produits agricoles dans un emballage pour l'isoler de son environnement, le protéger, le conserver, le transporter ou pour le mettre en valeur en vue de leur distribution. @fr
label: Empactage @fr
subclass of: Conservation

Physical protection
type: Class
comment: Agricultural crop protection practice using physical means.
comment: Pratique agricole de protection des cultures utilisant des moyens physiques. @fr
label: Protection physique @fr
subclass of: Plant protection

Phytosanitary protection
type: Class
comment: Agricultural practice of using a chemical or biological substance or mixture of substances to protect crops and stored agricultural products from pests.
comment: Pratique agricole utilisant une substance ou un mélange de substances de nature chimique ou biologique pour protéger les plantes cultivées et les produits agricoles stockés contre les bioagresseurs. @fr
label: Protection phytosanitaire @fr
subclass of: Plant protection

Pinching
type: Class
comment: Agricultural crop growth control practice that consist of impeding sap flow by cutting off the tip of a bud.
comment: Pratique agricole de contrôle de croissance de la culture consistant à entraver la montée des sèves en sectionnant l'extrémité d'un bourgeon. @fr
label: Pincement @fr
subclass of: Growth control

Plant descent
type: Class
comment: Agricultural practice of plant management consisting in lowering the level of certain crops that are maintained in height.
comment: Pratique agricole de conduite de la plante consistant à abaisser le niveau de certaines cultures qui sont maintenues en hauteur. @fr
label: Descente plante @fr
subclass of: Plant training

Plant material
type: Class
comment: Nature de l'organe végétal utilisé pour la mise en place d'une culture, pouvant s'agir d'une graine ou d'un plant. @fr
comment: Nature of the plant organ used for establishment of a crop, which can be a seed or a plant.
label: Matériel végétal @fr
subclass of: Resource

Plant protection
type: Class
comment: Agricultural practice related to the control of pests to reduce crop damage or loss.
comment: Pratique agricole liée à la lutte contre des organismes nuisibles pour réduire les dommages ou pertes des cultures. @fr
label: Protection des plantes @fr
subclass of: Crop cultivation

Plant training
type: Class
comment: All agricultural practices of managing the physical attitude of the plant.
comment: Ensemble des pratiques agricoles consistant à gérer le port de la plante. @fr
label: Conduite de la plante @fr
subclass of: Crop maintenance

Planting
type: Class
comment: Agricultural practice of crop establishment from already formed plants, either from seeds on the farm or purchased.
comment: Pratique agricole de mise en place de la culture à partir de plants déjà formés, soit à partir de graines sur l'exploitation même, soit achetés. @fr
label: Plantation @fr
subclass of: Row layout

Crop establishment
type: Class
comment: All actions that concerning the crop establishment.
comment: Ensemble des actions concernant la mise en place de la culture. @fr
label: Implantation @fr
subclass of: Farming practice

Planting stock
type: Class
comment: Matériel végétal désignant une jeune plante formée à partir d'une graine et destinée à être plantée. @fr
comment: Plant materiel designating a young plant formed from a seed and intended for planting.
label: Plant @fr
subclass of: Plant material

Plowing
type: Class
comment: Agricultural soil tillage practice consisting in opening and turning over the soil more or less deelply to favour the good development of the crop.
comment: Pratique agricole de travail du sol consistant à ouvrir et retourner le sol plus ou moins en profondeur pour favoriser le bon développement de la culture. @fr
label: Labour @fr
subclass of: Soil tillage with reversal

Practice
type: Class
comment: Task carried out on the farm, that may be agricultural or not.
comment: Tâche réalisée sur l'exploitation, pouvant être à caractère agricole ou non. @fr
label: Pratique @fr
subclass of: Entity

Disbudding
type: Class
comment: Agricultural growth control practice consisting in removing superfluous buds from a crop.
comment: Pratique agricole de contrôle de croissance consistant à supprimer les bourgeons superflus d'une culture. @fr
label: Ebourgeonnage @fr
subclass of: Growth control

Procedure
type: Class
label: Procédure @fr
subclass of: Collection

Process
type: Class
comment: Ensemble d'étapes constituant une méthode pour aboutir à un résultat recherché. @fr
comment: Set of steps composing a method to achieve a desired result.
label: Processus @fr
subclass of: Collection

Production process
type: Class
comment: Processus de génération d'une production végétale découpé en une ou plusieurs séries, elles-mêmes composées de tâches opérationnelles. @fr
comment: Vegetal production generation process sliced into one or more series, themselves composed by operational tasks.
label: Processus de production @fr
subclass of: Process

Pruning
type: Class
comment: Agricultural growth control practice consisting in removing some living or dead parts of a crop to preserve its appearance and health, and to regulate its growth.
comment: Pratique agricole de contrôle de croissance consistant à enlever certaines parties vivantes ou mortes d'une culture pour préserver son apparence et sa santé, et régulariser sa croissance. @fr
label: Taille @fr
subclass of: Growth control

Pruning bouquet
type: Class
comment: Agricultural growth control practice of either removing fruit to present a more even fruit cluster, or removing fruit clusters to promote the growth of others.
comment: Pratique agricole de contrôle de croissance consistant soit à enlever des fruits pour présenter une grappe de fruits plus réguliers, soit à retirer des grappes de fruits pour favoriser la croissance des autres. @fr
label: Taille des bouquets @fr
subclass of: Growth control

Put biodegradable plastic mulch
comment: Agricultural practice of mulching using tarpaulins or sheets of plastic materials that must be able to decompose in a short time under agricultural conditions.
comment: Pratique agricole de paillage utilisant des bâches ou toiles en matériaux plastiques qui doivent pouvoir se décomposer en un temps court en conditions agricoles. @fr
label: Pose paillage plastique biodégradable @fr

Irrigation installation
type: Class
comment: Establishment of irrigation water distribution systems for crops.
comment: Mise en place des systèmes de distribution d'eau d'irrigation pour les cultures. @fr
label: Installation de l'irrigation @fr
subclass of: Irrigation

Put occulting cover
type: Class
comment: Agricultural practice of soil remediation $consisting in covering the soil with an opaque cloth after having prepared the soil, in order to provoke the germination then the death by lack of light of the weeds under the cloth.
comment: Pratique agricole d'assainissement du sol consistant à le couvrir avec une toile opaque après avoir préparé le sol, afin de provoquer la germination puis la mort par manque de lumière des adventices en dessous de la toile. @fr
label: Pose occulting cover @fr
subclass of: Soil remediation

Put plastic mulch
comment: Agricultural practice of mulching using tarpaulins or sheets of plastic materials.
comment: Pratique agricole de paillage utilisant des bâches ou toiles en matériaux plastiques. @fr
label: Installation paillage plastique @fr

Protective net installation
type: Class
comment: Agricultural practice of protecting crops by placing a protective net over cultivated areas to limit crop damage.
comment: Pratique agricole de protection des cultures consistant à déposer sur les zones cultivées des filets protecteurs pour limiter les dommages causés sur les cultures. @fr
label: Pose du filet @fr
subclass of: Physical protection

Trellising installation
type: Class
comment: Agricultural practice of guiding the plant's development by placing structures on which the stems and branches are attached with ties.
comment: Pratique agricole de conduite de la plante consistant à guider son développement par la pose de structures sur lesquelles on vient attacher ses tiges et branches à l'aide de liens. @fr
label: Installation du palissage @fr
subclass of: Plant training

Put vegetal mulch
comment: Agricultural practice of mulching using plant materials to cover the soil.
comment: Pratique agricole de paillage utilisant des matériaux d'origine végétale pour couvrir le sol. @fr
label: Installation paillage végétal @fr

Put wintering cover
type: Class
comment: Agricultural practice of crop protection consisting in depositing on the cultivated area a thermal fabric to protect the crops from the cold.
comment: Pratique agricole de protection des cultures consistant à déposer sur la zone cultivée un tissu thermique pour protéger les cultures contre le froid. @fr
label: Pose du voile d’hivernage @fr
subclass of: Physical protection

Put woven fabrics
type: Class
comment: Agricultural mulching practice using plastic covers made by interlacing strips to increase the strength and permeability of the material.
comment: Pratique agricole de paillage utilisant des couvertures plastiques fabriquées en entrelaçant des bandelettes afin d'augmenter la résistance et la perméabilité du matériel. @fr
label: Pose toile tissée @fr
subclass of: Mulching

Remove biodegradable plastic mulch
comment: Agricultural mulching practice of removing biodegradable plastic covers from the soil.
comment: Pratique agricole de paillage consistant à retirer les couvertures en plastique biodégradable du sol. @fr
label: Retrait paillage plastique biodégradable @fr

Irrigation removal
type: Class
comment: Removing of irrigation water distribution systems for crops.
comment: Retrait des systèmes de distribution d'eau d'irrigation pour les cultures. @fr
label: Désinstallation de l'irrigation @fr
subclass of: Irrigation

Remove occulting cover
type: Class
comment: Agricultural mulching practice of removing the opaque cloth from an area to be cultivated after a sufficient time to have had an effect on weeds.
comment: Pratique agricole de paillage consistant à retirer la bâche opaque d'une zone à cultiver après une durée suffisante pour avoir eu un effet sur les adventices. @fr
label: Retrait bâche occultante @fr
subclass of: Soil remediation

Remove plastic mulch
comment: Agricultural mulching practice of removing plastic covers from the soil.
comment: Pratique agricole de paillage consistant à retirer les couvertures en plastique du sol. @fr
label: Retrait paillage plastique @fr

Protective net removal
type: Class
comment: Agricultural practice of crop protection consisting in removing the protective net from the cultivated areas.
comment: Pratique agricole de protection des cultures consistant à retirer des zones cultivées le filet protecteur. @fr
label: Retrait du filet @fr
subclass of: Physical protection

Trellising removal
type: Class
comment: Agricultural practice of plant management consisting in removing the structures used to guide the development of the crop.
comment: Pratique agricole de conduite de la plante consistant à retirer les structures servant à guider le développement de la culture. @fr
label: Démontage du palissage @fr
subclass of: Plant training

Remove vegetal mulch
comment: Agricultural mulching practice of removing vegetal covers from the soil.
comment: Pratique agricole de paillage consistant à retirer les couvertures d'origine végétale du sol. @fr
label: Retrait paillage végétal @fr

Remove wintering cover
type: Class
comment: Agricultural crop protection practice of removing thermal fabric from the cultivated area once the cold is no longer a risk to the crop.
comment: Pratique agricole de protection des cultures consistant à retirer de la zone cultivée le tissu thermique une fois que le froid n'est plus un risque pour les cultures. @fr
label: Retrait du voile d’hivernage @fr
subclass of: Physical protection

Remove woven fabrics
type: Class
comment: Agricultural mulching practice of removing the previously used woven fabric from the cultivable area.
comment: Pratique agricole de paillage consistant à retirer de la zone cultivable la toile tissée utilisée précédemment. @fr
label: Retrait toile tissée @fr
subclass of: Mulching

Resource
type: Class
label: Ressource @fr
subclass of: Entity

Ridging
type: Class
comment: Agricultural practice of superficial tillage consisting of bringing the soil from the planting intervals to the foot of the crop.
comment: Pratique agricole de travail du sol superficiel consistant à ramener la terre se trouvant dans les intervalles de plantation au pied de la culture. @fr
label: Buttage @fr
subclass of: Crop cultivation
subclass of: Surface tillage

Rolling
type: Class
comment: Agricultural practice using a roller that will be used either on the ground to level it, or on a crop to lay it down and destroy it without disturbing the soil, thus allowing not to re-sprout weeds.
comment: Pratique agricole utilisant un rouleau qui va être utilisé soit sur le sol pour l'aplanir, soit sur une culture pour la coucher et la détruire sans perturber le sol, permettant ainsi de ne pas relancer une germination des adventices. @fr
label: Roulage @fr
subclass of: Crop destruction

Row layout
type: Class
comment: Practice of crop layout in a linear manner following a furrow.
comment: Pratique de mise en place de la culture de manière linéaire en suivant un sillon. @fr
label: Implantation en ligne @fr
subclass of: Crop establishment

Seed
type: Class
comment: Matériel végétal désignant une semence destinée à être semée en pépinière ou sur la zone cultivable directement. @fr
comment: Plant materiel designating a seed intended to be sown in a sursery or on the cultivable area directly.
label: Graine @fr
subclass of: Plant material

Seedbed preparation
type: Class
comment: Agricultural practice of tilling the soil with machinery before the crop establishment in order to create a favorable structure to the emergence and good development of the crop.
comment: Pratique agricole de travail du sol utilisant des machines sur le sol avant l'implantation d'une culture dans le but de créer une structure favorable à la levée et à un bon développement de la culture. @fr
label: Préparation du lit de semence @fr
subclass of: Surface tillage

Seed drilling
type: Class
comment: Agricultural practice of crop establishment from seeds arranged in a linear manner following a furrow.
comment: Pratique agricole de mise en place de la culture à partir de graines disposées de manière linéaire en suivant un sillon. @fr
label: Semis en ligne @fr
subclass of: Row layout

Series
type: Class
comment: Désigne une des divisions du processus de production d'une culture donnée : implantation de cette culture à des dates successives, pour allonger la période de production de ce produit. @fr
comment: Refers to one of the divisions of the production process of a given crop: establishment of this crop at successive dates, in order to extend the production period of this product.
label: Série @fr
subclass of: Procedure

Soil amendment
type: Class
comment: Fertilization practice providing a nutrient product designed to improve the properties (physical, chemical and biological) of the soil, by adding limestone or organic matter.
comment: Pratique agricole de fertilisation apportant un produit nutritif destiné à améliorer les propriétés (physiques, chimiques et biologiques) du sol, par l’apport de calcaire ou de matières organiques. @fr
label: Amendement du sol @fr
subclass of: Soil preparation

Soil remediation
type: Class
comment: All the agricultural practices consisting in improving the global sanitary situation of the soil to favour the good development of the following crops.
comment: Ensemble des pratiques agricoles consistant à améliorer la situation sanitaire globale du sol pour favoriser le bon développement des cultures suivantes. @fr
label: Assainissement du sol @fr
subclass of: Soil preparation

Soil and climate context
type: Class
comment: All the characteristics of the soil and the climate contextualizing a plot or a production cell.
comment: Ensemble des caractéristiques du sol et du climat contextualisant une parcelle ou un îlot. @fr
label: Contexte pédoclimatique @fr
subclass of: Context

Soil context
type: Class
comment: Ensemble des caractéristiques pédologiques concernant une exploitation ou un itinéraire technique. @fr
comment: Set of pedological characteristics regarding a farm or a crop itinerary.
label: Contexte du sol @fr
subclass of: Context

Soil decompacting
type: Class
comment: Agricultural deep tillage practice using a decompactor to aerate overly compated soils and break up potential plow footings without turning over the soil.
comment: Pratique agricole de travail du sol profond utilisant un décompacteur pour aérer les sols trop compactés et casser les potentielles semelles de labour sans retournement du sol. @fr
label: Décompactage @fr
subclass of: Soil tillage without reversal

Soil preparation
type: Class
comment: All agricultural practices related to the creation, at the soil level, of a favorable environment for the establishment of a crop.
comment: Ensemble des pratiques agricoles liées à la création, au niveau du sol, d'un environnement favorable à l'implantation d'une culture. @fr
label: Préparation sol @fr
subclass of: Farming practice

Soil tillage
type: Class
comment: Agricultural practice using various tools in order to create a favorable environment for crop development in the soil.
comment: Pratique agricole utilisant divers outils dans le but de créer dans le sol un milieu favorable au développement des cultures. @fr
label: Travail du sol @fr
subclass of: Soil preparation

Soil solarization
type: Class
comment: Agricultural practice of soil sanitation consisting in covering the soil with a transparent cloth in order to make weeds emerge and then to destroy them thanks to the temperature increase under the tarpaulin.
comment: Pratique agricole d'assainissement du sol consistant à le couvrir avec une toile transparente afin faire lever les adventices puis de les détruire grâce à l'augmentation de température sous la bâche. @fr
label: Solarisation @fr
subclass of: Soil remediation

Stale seed bed
type: Class
comment: Agricultural practice of soil sanitation consisting of preparing a seedbed, allowing weeds to emerge and then weeding without disturbing the soil before planting the crop.
comment: Pratique agricole d'assainissement du sol consistant à préparer un lit de semence, à laisser les adventices lever puis à effectuer un désherbage sans perturbation du sol avant d'implanter la culture. @fr
label: Faux semis @fr
subclass of: Soil remediation

Steam disinfection
type: Class
comment: Agricultural practice of soil sanitation using a means of thermal control by raising the temperature up to 90 °C via the injection of steam into the soil to disinfect its surface layers.
comment: Pratique agricole d'assainissement du sol utilisant un moyen de lutte thermique en élevant la température jusq'à 90 °C via l'injection de vapeur d'eau dans le sol pour désinfecter les couches superficielles de celui-ci. @fr
label: Désinfection à la vapeur @fr
subclass of: Soil remediation

Stone burrying
type: Class
comment: Agricultural practice of deep tillage with turning over to bury surface stones deep into the soil to prepare it for crop establishment.
comment: Pratique agricole de travail du sol profond avec retournement qui permet d'enfouir les cailloux de surface en profondeur dans le sol pour le préparer à l'implantation de la culture. @fr
label: Enfouissage de pierres @fr
subclass of: Soil tillage with reversal

Storage
type: Class
comment: Agricultural post-harvest conservation practice related to the conservation of an agricultural product, consisting of storing for a given period according to standards and rules that allow its proper conservation before distribution.
comment: Pratique agricole post-récolte de conservation liée à la conservation d'un produit agricole, consistant à l'entreposer pour une période donnée suivant des normes et règles qui permettent sa bonne conservation avant distribution. @fr
label: Stockage @fr
subclass of: Conservation

Stubble ploughing
type: Class
comment: Agricultural practice of superficial tillage consisting of burying stubble and crop remains to promote their decomposition.
comment: Pratique agricole de travail du sol superficiel consistant à enfouir les chaumes et restes de cultures afin de favoriser leur décomposition. @fr
label: Déchaumage @fr
subclass of: Surface tillage

Subsoiling
type: Class
comment: Agricultural practice of deep tillage using a subsoiler to break up or loosen a compact layer of soil without turning it over to a depth greater than that of plowing.
comment: Pratique agricole de travail du sol profond utilisant une sous-soleuse visant à briser ou ameublir sans retournement une couche compacte du sol à une profondeur supérieure à celle des labours. @fr
label: Sous solage @fr
subclass of: Soil tillage without reversal

Surface tillage
type: Class
comment: Agricultural tillage practice using various tools on the surface without disturbing the deep soil horizons.
comment: Pratique agricole de travail du sol utilisant divers outils en surface sans perturber les horizons profonds du sol. @fr
label: Travail du sol superficiel @fr
subclass of: Soil tillage

Technical operation
type: Class
comment: Agricultural task that may or may not belong to a crop itinary, concerning the crops, the plot or the facilities of the farm.
comment: Tâche agricole pouvant appartenir à un itinéraire de culture ou non, portant sur les cultures, la parcelle ou les installations de l'exploitation. @fr
label: Opération technique @fr
subclass of: Operation

Thermal weeding
type: Class
comment: Agricultural weed control practice carried out with thermal means.
comment: Pratique agricole de désherbage réalisée via des moyens thermiques. @fr
label: Désherbage thermique @fr
subclass of: Weed control

Thinning
type: Class
comment: Agricultural growth control practice consisting of removing plants from a seedling, fruits from a plant etc... to promote the growth of others.
comment: Pratique agricole de contrôle de croissance consistant à supprimer les plants d'un semis, des fruits d'un plant etc... pour favoriser la croissance des autres. @fr
label: Éclaircissage @fr
subclass of: Weed control

Topping
type: Class
comment: Agricultural growth control practice of eliminating the terminal bud to promote lateral bud development or accelerate fruit development and ripening.
comment: Pratique agricole de contrôle de croissance consistant à éliminer le bourgeon terminal pour favoriser le développement des bourgeons latéraux ou accélérer le développement et la maturation des fruits. @fr
label: Étêtage @fr
subclass of: Growth control

Trellising
type: Class
comment: Structure permettant d'attacher les tiges et branches d'une culture à l'aide de liens, pour les orienter dans une direction déterminée, dans le but d'en améliorer la qualité et le rendement. @fr
comment: Structure used to tie the stems and branches of a crop to orient them in a specific direction in order to improve quality and yield.
label: Palissage @fr
subclass of: Plant training

Washing
type: Class
comment: Agricultural conservation practice that involves running water over harvested produce to improve preservation and reduce health risks.
comment: Pratique agricole de conservation consistant à passer de l'eau sur les produits récoltés pour en améliorer la conservation et réduire les risques sanitaires. @fr
label: Lavage @fr
subclass of: Conservation

Watering
type: Class
comment: Agricultural practice consisting of artificial water supply on crops to improve the productivity or to compensate a water deficit.
comment: Pratique agricole d'apport artificiel d'eau à des cultures pour en améliorer la productivité ou combler un déficit d'eau. @fr
label: Arrosage @fr
subclass of: Irrigation

Weed control
type: Class
comment: Agricultural practice of eliminating or limiting the development of weeds to reduce their harmfulness to crops.
comment: Pratique agricole consistant à éliminer ou à limiter le développement des adventices pour réduire leur nuisibilité sur les plantes cultivées. @fr
label: Maîtrise de l'enherbement @fr
subclass of: Crop maintenance

Soil tillage with reversal
type: Class
comment: Agricultural soil tillage practice using tools that turn over soil horizons.
comment: Pratique agricole de travail du sol utilisant des outils qui retournent les horizons de sol. @fr
label: Travail du sol avec retournement @fr
subclass of: Deep tillage

Soil tillage without reversal
type: Class
comment: Agricultural practice of working the soil with machines without turning it over.
comment: Pratique agricole consistant à travailler le sol avec des machines sans le retourner. @fr
label: Travail du sol sans retournement @fr
subclass of: Deep tillage

acts on stage
type: ObjectProperty
domain: Technical operation
label: agit sur le stade @fr
range: BiologicalStep

applies this crop itinerary
type: ObjectProperty
domain: Production process
label: applique cet itinéraire de culture @fr
range: Crop itinerary

average germination rate
label: taux de levée moyen @fr

belongs to administrative region
type: ObjectProperty
domain: Soil and climate context
label: appartient à une région administrative @fr
range: Class
  intersection of: Concept
  intersection of: Restriction
    has value: Region
    on property: broader

comment
type: DatatypeProperty
domain: Observation
label: commentaire @fr
range: Literal

concerns plant
type: ObjectProperty
domain: Crop itinerary
label: concerne la plante @fr
range: CultivatedPlant

concerns position
type: ObjectProperty
domain: Activity
domain: Operation task
label: concerne l'emplacement @fr
range: LandUse

cultivates in
type: ObjectProperty
domain: Cultural context
label: cultive en @fr
range: Class
  intersection of: Concept
  intersection of: Restriction
    has value: FarmingSystem
    on property: broader

depends on cultural context
type: ObjectProperty
domain: Crop itinerary
label: dépend d'un contexte de culture @fr
range: Cultural context

depends on soil climate context
type: ObjectProperty
domain: Crop itinerary
label: dépend d'un contexte pédo-climatique @fr
range: Soil and climate context

description
type: DatatypeProperty
domain: Farming practice
range: string

distance duration
type: ObjectProperty
domain: Distance between operations
label: durée de distance @fr
range: Duration

edge distance
type: ObjectProperty
domain: Row layout
label: distance au bord @fr
range: Length

end marker
type: DatatypeProperty
domain: Distance between operations
label: marqueur de fin @fr
range: boolean

follows
type: ObjectProperty
domain: Crop entity
label: suit @fr
range: Crop entity
inverse of: precedes

frequency
type: DatatypeProperty
domain: Technical operation
label: fréquence @fr
range: Literal

generates activity
type: ObjectProperty
domain: Operation task
label: génère l'intervention @fr
range: Activity

generates operational task
type: ObjectProperty
domain: Technical operation
label: génère la tâche opérationnelle @fr
range: Operation task

grows according to
type: ObjectProperty
domain: Plant
label: croît selon @fr
range: Biological process

harvest margin loss
type: DatatypeProperty
domain: Harvest
label: marge de perte pour la récolte @fr
range: decimal

has assertion
type: ObjectProperty
domain: Condition
label: a pour argument @fr
range: Context

is assigned to
type: ObjectProperty
domain: Activity
label: est assigné(e) à @fr
range: Producer

has bed planting densité
type: ObjectProperty
domain: Crop establishment
label: a pour densité d’implantation sur planche @fr
range: PlantingDensity

has climate
type: ObjectProperty
domain: Climate context
label: a pour climat @fr
range: Class
  intersection of: Concept
  intersection of: Restriction
    has value: Climate
    on property: broader

has climate characteristic
type: ObjectProperty
domain: Climate context
label: a pour caractéristique climatique @fr
range: Class
  intersection of: Concept
  intersection of: Restriction
    has value: ClimateCharacteristics
    on property: broader

has climate context
type: ObjectProperty
domain: Soil and climate context
label: a pour contexte climatique @fr
range: Climate context

has conclusion
type: ObjectProperty
domain: Condition
label: a pour conclusion @fr
range: Thing

has conservation duration
type: ObjectProperty
domain: Crop itinerary
label: a pour durée de conservation @fr
range: Duration

has cultivable position
type: ObjectProperty
domain: Class
  union of: Activity
  union of: Series
label: a pour emplacement cultivable @fr
range: Cultivable position

has cultural context
type: ObjectProperty
domain: Farm
label: a un contexte de culture @fr
range: Cultural context

has cultural role
type: ObjectProperty
domain: Plant material
label: a pour rôle cultural @fr
range: Class
  intersection of: Concept
  intersection of: Restriction
    has value: CultureRole
    on property: broader

has culture mode
type: ObjectProperty
domain: Crop itinerary
label: a pour mode de culture @fr
range: Class
  intersection of: Concept
  intersection of: Restriction
    has value: CultureMode
    on property: broader

has duration
type: ObjectProperty
domain: Activity
label: a pour durée @fr
range: Duration

has farm equipment level
type: ObjectProperty
domain: Cultural context
label: a pour niveau d’équipement @fr
range: Class
  intersection of: Concept
  intersection of: Restriction
    has value: FarmEquipmentLevel
    on property: broader

has farming practice parameter
type: ObjectProperty
label: a pour paramètre de pratique agricole @fr
range: CultivationParameter
sub property of: hasParameter

has following rotation
type: ObjectProperty
domain: Cultivable position
label: a pour rotation suivante @fr
range: Cultivable position
inverse of: has preceding rotation

has global available volume
type: ObjectProperty
domain: Crop
label: a pour volume global disponible @fr
range: HarvestQuantity

has global booked volume
type: ObjectProperty
domain: Crop
label: a pour volume global pré-réservé @fr
range: HarvestQuantity

has global delivered volume
type: ObjectProperty
domain: Crop
label: a pour volume global livré @fr
range: HarvestQuantity

has global estimated volume
type: ObjectProperty
domain: Crop
label: a pour volume global estimé @fr
range: HarvestQuantity

has global ordered volume
type: ObjectProperty
domain: Crop
label: a pour volume global commandé @fr
range: HarvestQuantity

has global workload
type: ObjectProperty
domain: Crop itinerary
label: a pour charge de travail globale @fr
range: Workload
sub property of: hasParameter

has harvest duration
type: ObjectProperty
domain: Crop itinerary
label: a pour durée de récolte @fr
range: Duration

has harvest mode
type: ObjectProperty
domain: Harvest
label: a pour mode de récolte @fr
range: Class
  intersection of: Concept
  intersection of: Restriction
    has value: HarvestMode
    on property: broader

has harvest quantity
type: ObjectProperty
domain: Harvest
label: a pour quantité de récolte @fr
range: HarvestQuantity
sub property of: has farming practice parameter

has input dose
type: ObjectProperty
domain: Class
  union of: Biological plant protection
  union of: Fertilisation
  union of: Phytosanitary protection
  union of: Soil amendment
label: a pour dose d'intrant @fr
range: Dosage
sub property of: has farming practice parameter

has irrigation duration
type: ObjectProperty
domain: Watering
label: a pour durée d'irrigation @fr
range: Duration

has irrigation mode
type: ObjectProperty
domain: Class
  union of: Crop itinerary
  union of: Irrigation
label: a pour mode d’irrigation @fr
range: Class
  intersection of: Concept
  intersection of: Restriction
    has value: IrrigationMode
    on property: broader

has irrigation quantity
type: ObjectProperty
domain: Watering
label: a pour quantité d'irrigation @fr
range: Volume
sub property of: hasParameter

has length position
type: ObjectProperty
domain: Cultivable position
label: a pour longueur d'emplacement @fr
range: Length
sub property of: hasParameter

has maturation duration
type: ObjectProperty
domain: Crop itinerary
label: a pour durée de maturité @fr
range: Duration

has member
type: ObjectProperty
domain: Collection
label: a pour membre @fr
range: Crop entity
inverse of: is member of

has nursery duration
type: ObjectProperty
domain: Crop itinerary
label: a pour durée de pépinière @fr
range: Duration

has observation
type: ObjectProperty
domain: Thing
label: a pour observation @fr
range: Observation

has observed subject
type: ObjectProperty
domain: Observation
label: a pour type d'observation @fr
range: Class
  intersection of: Concept
  intersection of: Restriction
    has value: ObservedSubject
    on property: broader

has operation distance
type: ObjectProperty
domain: Operation
label: a pour distance d’opération @fr
range: Distance between operations

had operation member
type: ObjectProperty
label: est composé de l'opération @fr
sub property of: has member

has period
type: ObjectProperty
domain: Class
  union of: Operation task
  union of: Series
label: a pour période @fr
range: ProperInterval

has favored photoperiodicity
type: ObjectProperty
domain: Technical operation
label: a pour photopériode privilégiée @fr
range: Class
  intersection of: Concept
  intersection of: Restriction
    has value: PhotoPeriodicity
    on property: broader

has planting density
type: ObjectProperty
label: a pour densité d'implantation @fr
sub property of: has farming practice parameter

has plot planting density
type: ObjectProperty
domain: Crop establishment
label: a pour densité d’implantation sur parcelle @fr
range: PlantingDensity

has position surface
type: ObjectProperty
domain: Cultivable position
label: a pour surface emplacement @fr
range: Surface
sub property of: hasSurface

has preceding rotation
type: ObjectProperty
domain: Cultivable position
label: a pour rotation précédente @fr
range: Cultivable position

has relative period
type: ObjectProperty
domain: Class
  union of: Crop itinerary
  union of: Technical operation
label: a pour période relative @fr
range: RelativeProperInterval

has seasonality
type: ObjectProperty
domain: Crop itinerary
label: a pour saisonnalité @fr
range: Class
  intersection of: Concept
  intersection of: Restriction
    has value: Seasonality
    on property: broader

has seeding density
type: ObjectProperty
domain: Crop establishment
label: a pour densité de semence @fr
range: PlantingDensity

has series member
type: ObjectProperty
domain: Production process
label: est composé de la série @fr
range: Series
sub property of: has member

has soil climate context
type: ObjectProperty
domain: Farm
label: a pour contexte pédo-climatique @fr
range: Soil and climate context

has soil context
type: ObjectProperty
domain: Soil and climate context
label: a pour contexte de sol @fr
range: Soil context

has soil nature
type: ObjectProperty
domain: Soil context
label: a pour nature du sol @fr
range: Class
  intersection of: Concept
  intersection of: Restriction
    has value: SoilNature
    on property: broader

has soil texture
type: ObjectProperty
domain: Soil context
label: a pour texture de sol @fr
range: Class
  intersection of: Concept
  intersection of: Restriction
    has value: SoilTexture
    on property: broader

has member stage
type: ObjectProperty
domain: Biological process
label: a pour stade membre @fr
range: BiologicalStep
sub property of: has member

has storage duration
type: ObjectProperty
domain: Storage
label: a pour durée de stockage @fr
range: Duration

has stored quantitiy
type: ObjectProperty
domain: Storage
label: a pour quantité stocké @fr
range: HarvestQuantity

has supplier
type: ObjectProperty
domain: Resource
label: a pour fournisseur @fr
range: Supplier

had task member
type: ObjectProperty
domain: Series
label: est composé de la tâche @fr
range: Operation task
sub property of: has member

has workload
type: ObjectProperty
domain: Practice
label: a pour charge de travail @fr
range: Workload
sub property of: hasParameter

has yield
type: ObjectProperty
domain: Class
  union of: Procedure
  union of: Process
label: a pour rendement @fr
range: Yield
sub property of: hasParameter

implements
type: ObjectProperty
domain: Operation
label: met en oeuvre @fr
range: Farming practice

influences
type: ObjectProperty
domain: Operation
label: influence @fr
range: Cultural context

is associated with
type: ObjectProperty
domain: Production process
label: est associé avec @fr
range: Production process

is constrained by
type: ObjectProperty
domain: Class
  union of: Crop itinerary
  union of: Technical operation
label: est contraint par @fr
range: Condition

is cultivated according to
type: ObjectProperty
domain: CultivatedPlant
label: est cultivée selon @fr
range: Production process

is derived from
type: ObjectProperty
label: a pour référence @fr

is derived from itinerary
type: ObjectProperty
domain: Crop itinerary
label: a pour itinéraire de culture de référence @fr
range: Crop itinerary
sub property of: is derived from

has reference operation
type: ObjectProperty
domain: Technical operation
label: a pour opération de référence @fr
range: Technical operation
sub property of: is derived from

is derived from stage
type: ObjectProperty
domain: BiologicalStep
label: est dérivée du stade @fr
range: BiologicalStep
sub property of: is derived from

is forced crop
type: DatatypeProperty
domain: Crop itinerary
label: est une culture forcée @fr
range: boolean

is a grafted crop
type: DatatypeProperty
domain: Crop itinerary
label: est une culture greffée @fr
range: boolean

is located
type: ObjectProperty
domain: Cultivable position
label: est situé @fr
range: CultivableLand

is member of
type: ObjectProperty
label: est membre de @fr

is specialised from itinerary
type: ObjectProperty
domain: Crop itinerary
label: est spécialisé depuis l’itinéraire @fr
range: Crop itinerary

loss margin
type: DatatypeProperty
domain: Crop itinerary
label: Marge de perte @fr
range: decimal

negation
type: DatatypeProperty
domain: Condition
label: négation @fr
range: boolean

plants number
type: DatatypeProperty
domain: Planting
label: nombre de plants @fr
range: decimal

number rows
type: DatatypeProperty
domain: Row layout
label: nombre de rangs @fr
range: integer

seeds number
type: DatatypeProperty
domain: Seed drilling
label: nombre de graines @fr
range: decimal

observation date
type: DatatypeProperty
domain: Observation
label: date d’observation @fr
range: dateTimeStamp

occurs at
type: ObjectProperty
domain: Activity
label: se produit à @fr
range: Instant

precedes
type: ObjectProperty
domain: Crop entity
label: précède @fr
range: Crop entity

produces
type: ObjectProperty
domain: Production process
label: produit @fr
range: Crop

recommends association
type: ObjectProperty
domain: Crop itinerary
label: association de culture recommandée @fr
range: Association

recommends cultivar
type: ObjectProperty
domain: Crop itinerary
label: cultivar recommandé @fr
range: Cultivar

recommends rotation
type: ObjectProperty
domain: Crop itinerary
label: rotation de culture recommandée @fr
range: Rotation

refers to operation
type: ObjectProperty
domain: Distance between operations
label: se réfère à l’opération @fr
range: Operation

selects cultivar
type: ObjectProperty
domain: Farm
label: selectionne pour cultivar @fr
range: Cultivar

soil Ph
type: DatatypeProperty
domain: Soil context
label: Ph du sol @fr
range: decimal

spacing between rows
type: ObjectProperty
domain: Row layout
label: espacement entre les rangs @fr
range: Length

spacing in row
type: ObjectProperty
domain: Row layout
label: espacement dans le rang @fr
range: Length

surface done
type: DatatypeProperty
domain: Activity
label: surface réalisée @fr
range: decimal

thinning rate
type: DatatypeProperty
domain: Class
  union of: Broadcast planting process
  union of: Seed drilling
label: taux d’éclaircissage @fr
range: decimal

uses cultivar
type: ObjectProperty
domain: Plant material
label: utilise pour cultivar @fr
range: Cultivar

uses farming equipment
type: ObjectProperty
domain: Farming practice
label: utilise matériel agricole @fr
range: Equipment

uses input
type: ObjectProperty
domain: Class
  union of: Biological plant protection
  union of: Fertilisation
  union of: Phytosanitary protection
  union of: Soil amendment
label: utilise intrant @fr
range: Intrant

uses plant material
type: ObjectProperty
domain: Plant material
label: utilise matériel végétal @fr
range: Series